{"text_format":"1","workbook":"xlsx","n_sheets":26,"sheets":["Light","Music","Heating","Entry","Quick Planning","QuickPlanning2","Sensors","Distributors","Tree","Wireless","Other","Shading","Switch","Ms&Extensions","Main","Power","Project information","Space","Products","Datanorm","Sample Quote","News","Translating_general","Message Box","Calculation","Translating_products"],"not_rendered":{"charts":0,"images":19,"macros":1,"external_links":0,"defined_names":15,"comments":2,"pivot_tables":0},"unopened":[],"bounds":{"document_bytes":16777216,"sheet_cells":100000,"rows_first":2000,"rows_last":500,"rows_between":2000,"halvings":0,"cell_chars":16384,"cell_head_chars":4096},"cells_cut":0,"cells_raw":0,"read":"whole","date_system":"1900"}

{"sheet":"Light","index":0,"n_rows":34,"n_cols":16,"rows_kept":34,"cut":false,"hidden":true,"merged":[]}
["Artikelnummer+","Bezeichnung","Preis excl.","Preis Inkl.","Notiz"]
["100012",{"$f":"Products!D12","v":"DMX Extension"},{"$f":"Products!E12","v":5619.01},{"$f":"Products!F12","v":6799.0020999999997}]
["100029",{"$f":"VLOOKUP(Main!C2,Translating_general!A101:P118,2,FALSE)","v":"Dimmer Extension (Výběr kanálu)"}]
["100117",{"$f":"Products!D27","v":"RGBW 24V Dimmer DMX"},{"$f":"Products!E27","v":1499},{"$f":"Products!F27","v":1813.79}]
["100125",{"$f":"Products!D29","v":"RGBW 24V Dimmer Air"},{"$f":"Products!E29","v":1849},{"$f":"Products!F29","v":2237.29}]
["200042",{"$f":"Products!D73","v":"5m RGB LED pásky IP20 (bez ochrany proti vodě)"},{"$f":"Products!E73","v":2149},{"$f":"Products!F73","v":2600.29}]
["200043",{"$f":"Products!D74","v":"5m LED pásky (teplá bílá) - IP20 (bez ochrany proti vodě)"},{"$f":"Products!E74","v":2149},{"$f":"Products!F74","v":2600.29}]
["200046",{"$f":"Products!D75","v":"5m RGB LED pásky IP68 (proti potopení do vody)"},{"$f":"Products!E75","v":2499},{"$f":"Products!F75","v":3023.79}]
[100153,{"$f":"Products!D37","v":"Nano IO Air"},{"$f":"Products!E37","v":2499},{"$f":"Products!F37","v":3023.79}]
["200061",{"$f":"Products!D82","v":"5m LED pásky (teplá bílá) - IP65 (proti tryskající vodě)"},{"$f":"Products!E82","v":2299},{"$f":"Products!F82","v":2781.79}]
["200092",{"$f":"Products!D93","v":"5m LED pásky (teplá bílá) - IP68 (proti potopení do vody)"},{"$f":"Products!E93","v":2499},{"$f":"Products!F93","v":3023.79}]
["200098",{"$f":"Products!D98","v":"5m RGBW LED pásky IP20 (bez ochrany proti vodě)"},{"$f":"Products!E98","v":2999},{"$f":"Products!F98","v":3628.79}]
["200099",{"$f":"Products!D99","v":"5m RGBW LED pásky IP65 (proti tryskající vodě)"},{"$f":"Products!E99","v":3099},{"$f":"Products!F99","v":3749.79}]
["200100",{"$f":"Products!D100","v":"5m RGBW LED pásky IP68 (proti potopení do vody)"},{"$f":"Products!E100","v":3249},{"$f":"Products!F100","v":3931.29}]
[200280,{"$f":"Products!D140","v":"Příslušenství k LED páskům - set RGBW"},{"$f":"Products!E140","v":449},{"$f":"Products!F140","v":543.29}]
[200278,{"$f":"Products!D141","v":"Příslušenství k LED páskům - set WW"},{"$f":"Products!E141","v":325},{"$f":"Products!F141","v":393.25}]
[null,{"$f":"VLOOKUP(Main!C2,Translating_general!A101:P118,3,FALSE)","v":"Analog 1-10V"}]
[null,{"$f":"VLOOKUP(Main!C2,Translating_general!A101:P118,4,FALSE)","v":"Světelný okruh 5A"}]
[100204,{"$f":"Products!D147","v":"LED Spot RGBW"},{"$f":"Products!E147","v":1349},{"$f":"Products!F147","v":1632.29}]
[100203,{"$f":"Products!D148","v":"LED Spot WW"},{"$f":"Products!E148","v":899},{"$f":"Products!F148","v":1087.79}]
[null,{"$f":"VLOOKUP(Main!C2,Translating_general!A101:AK118,37,FALSE)","v":"Dali Channel"}]
[null,{"$f":"VLOOKUP(Main!C2,Translating_general!A101:AM118,39,FALSE)","v":"Světelný okruh 16A"}]
[null,{"$f":"Products!D180","v":"Příložný LED Spot RGBW bílá"}]
[null,{"$f":"Products!D181","v":"Příložný LED Spot WW bílá"},null,null,null,null,null,null,null,null,null,null,{"$f":"VLOOKUP(Main!C2,Translating_general!A101:P118,5,FALSE)","v":"Stmívatelný okruh 230V"}]
[null,{"$f":"Products!D182","v":"Příložný LED Spot Tree RGBW bílá"},null,null,null,null,null,null,null,null,null,null,{"$f":"VLOOKUP(Main!C2,Translating_general!A101:P118,6,FALSE)","v":"Stmívatelný okruh 0-10V s elektronickým předřadníkem"},null,null,"DMX Dimmer 4 Kanal muss addiert werden"]
[null,{"$f":"Products!D183","v":"Příložný LED Spot Tree WW bílá"},null,null,null,null,null,null,null,null,null,null,{"$f":"VLOOKUP(Main!C2,Translating_general!A101:P118,7,FALSE)","v":"DMX Dimmer 50W na kanál"},null,null,"Air Dimmer 4 Kanal muss addiert werden"]
[null,{"$f":"Products!D184","v":"LED Spot Tree WW bílá"},null,null,null,null,null,null,null,null,null,null,{"$f":"VLOOKUP(Main!C2,Translating_general!A101:P118,8,FALSE)","v":"Air Dimmer kanál 50W"}]
[null,{"$f":"Products!D185","v":"LED Spot Tree RGBW bílá"}]
[null,{"$f":"Products!D186","v":"RGBW 24V Dimmer Tree"}]
[null,{"$f":"Products!D191","v":"Krabice do betonu pro LED spot"},null,null,null,null,null,null,null,null,null,null,"DMX Extension für Signal"]
[null,null,null,null,null,null,null,null,null,null,null,null,"DMX Dimmer für LED Streifen"]
[null,null,null,null,null,null,null,null,null,null,null,null,"Netzteil 4,2 Ampere"]
[null,null,null,null,null,null,null,null,null,null,null,null,"Pro Streifen 1 Dimmer"]
[null,null,null,null,null,null,null,null,null,null,null,null,"Dimmer einfach so auswählen"]

{"sheet":"Music","index":1,"n_rows":13,"n_cols":5,"rows_kept":13,"cut":false,"hidden":true,"merged":[]}
["Artikelnummer+","Bezeichnung","Preis excl.","Preis Inkl.","Notiz"]
[null,{"$f":"VLOOKUP(Main!$C$2,Translating_general!$A$101:$T$118,20,FALSE)","v":"Zóna Music Serveru"}]
["100165",{"$f":"Products!D42","v":"Loxone Music Server 4 Zóny"},{"$f":"Products!E42","v":31999},{"$f":"Products!F42","v":38718.79}]
["100166",{"$f":"Products!D43","v":"Loxone Music Server 8 Zón"},{"$f":"Products!E43","v":44999},{"$f":"Products!F43","v":54448.79}]
["100167",{"$f":"Products!D44","v":"Loxone Music Server 12 Zón"},{"$f":"Products!E44","v":52499},{"$f":"Products!F44","v":63523.79}]
["100168",{"$f":"Products!D45","v":"Loxone Music Server 16 Zón"},{"$f":"Products!E45","v":64999},{"$f":"Products!F45","v":78648.789999999994}]
["100169",{"$f":"Products!D46","v":"Loxone Music Server 20 Zón"},{"$f":"Products!E46","v":74999},{"$f":"Products!F46","v":90748.79}]
["200097",{"$f":"Products!D97","v":"Loxone Speaker"},{"$f":"Products!E97","v":2225},{"$f":"Products!F97","v":2692.25}]
["200110",{"$f":"Products!D104","v":"Loxone 12ti kanálový zesilovač"},{"$f":"Products!E104","v":15999},{"$f":"Products!F104","v":19358.79}]
["200150",{"$f":"Products!D112","v":"Instalační box pro Loxone reproduktor (speaker)"},{"$f":"Products!E112","v":1199},{"$f":"Products!F112","v":1450.79}]
["200153",{"$f":"Products!D114","v":"Loxone Wall Speaker"},{"$f":"Products!E114","v":3099},{"$f":"Products!F114","v":3749.79}]
[200202,{"$f":"Products!D139","v":"Loxone Speaker back box pro snížené stropy"},{"$f":"Products!E139","v":999},{"$f":"Products!F139","v":1208.79}]
[100205,{"$f":"Products!D143","v":"Loxone Music Server Upgrade"},{"$f":"Products!E143","v":2699},{"$f":"Products!F143","v":3265.79}]

{"sheet":"Heating","index":2,"n_rows":11,"n_cols":5,"rows_kept":11,"cut":false,"hidden":true,"merged":[]}
["Artikelnummer+","Bezeichnung","Preis excl.","Preis Inkl.","Notiz"]
["100163",null,{"$f":"Products!E41","v":2099},{"$f":"Products!F41","v":2539.79}]
["200003",null,{"$f":"Products!E57","v":1032.23},{"$f":"Products!F57","v":1248.9983}]
[200004,{"$f":"Products!D41","v":"Hlavice Air"},{"$f":"Products!E58","v":0},{"$f":"Products!F58","v":0}]
[200005,{"$f":"Products!D57","v":"Venkovní senzor teploty"},{"$f":"Products!E59","v":0},{"$f":"Products!F59","v":0}]
[200006,{"$f":"Products!D60","v":"Vnitřní teplotní senzor 0-10V"},{"$f":"Products!E60","v":1032.23},{"$f":"Products!F60","v":1248.9983}]
[200010,{"$f":"Products!D62","v":"Senzor teploty a vlhkosti (vnitřní) 0-10V"},{"$f":"Products!E62","v":2189.2600000000002},{"$f":"Products!F62","v":2649.0046000000002}]
[200017,{"$f":"Products!D65","v":"Senzor CO2/Teplota/Vlhkost"},{"$f":"Products!E65","v":5784.3},{"$f":"Products!F65","v":6999.0029999999997}]
[200077,{"$f":"Products!D87","v":"1-Wire teplotní čip v pouzdře"},{"$f":"Products!E87","v":285.39999999999998},{"$f":"Products!F87","v":345.33399999999995}]
[200109,{"$f":"VLOOKUP(Main!C2,Translating_general!A101:P118,9,FALSE)","v":"1-Wire teplotní senzor"},{"$f":"Products!E103","v":1049},{"$f":"Products!F103","v":1269.29}]
[null,{"$f":"Products!D154","v":"Hlavice Tree"}]

{"sheet":"Entry","index":3,"n_rows":9,"n_cols":5,"rows_kept":9,"cut":false,"hidden":true,"merged":[]}
["Artikelnummer+","Bezeichnung","Preis excl.","Preis Inkl.","Notiz"]
["200063",{"$f":"Products!D83","v":"Čtečka elektronického klíče"},{"$f":"Products!E83","v":230.58},{"$f":"Products!F83","v":279.0018}]
["200064",{"$f":"Products!D84","v":"Elektronický klíč"},{"$f":"Products!E84","v":81.819999999999993},{"$f":"Products!F84","v":99.002199999999988}]
["200070",{"$f":"Products!D86","v":"Elektronický klíč (Magnetický)"},{"$f":"Products!E86","v":205.79},{"$f":"Products!F86","v":249.0059}]
["200093",{"$f":"Products!D94","v":"Loxone Intercom"},{"$f":"Products!E94","v":24999},{"$f":"Products!F94","v":30248.79}]
["200094",{"$f":"Products!D95","v":"Zapuštěný box pro Loxone Intercom"},{"$f":"Products!E95","v":1375},{"$f":"Products!F95","v":1663.75}]
["200095",{"$f":"Products!D96","v":"Povrchový box pro Loxone Intercom"},{"$f":"Products!E96","v":2499},{"$f":"Products!F96","v":3023.79}]
["200191",{"$f":"Products!D137","v":"čtečka elektronického klíče - nerez"},{"$f":"Products!E137","v":779},{"$f":"Products!F137","v":942.58999999999992}]
[200273,{"$f":"Products!D144","v":"Loxone Intercom XL"},{"$f":"Products!E144","v":31499},{"$f":"Products!F144","v":38113.79}]

{"sheet":"Quick Planning","index":4,"n_rows":41,"n_cols":16,"rows_kept":41,"cut":false,"hidden":true,"merged":[[4,0,4,12],[12,0,12,12],[40,0,40,12]]}
[]
[]
[]
[]
["Projektinformation"]
[]
[]
[]
[]
[]
[]
[]
["Räume",null,null,null,null,null,null,null,null,null,null,null,null,null,"Aktiver Raum","hj"]
[null,null,null,null,null,null,null,null,null,null,null,null,null,null,null,"hj"]
[null,null,null,null,null,null,null,null,null,null,null,null,null,null,null,"re"]
[]
[]
[]
[]
[]
[]
[]
[]
[]
[]
[]
[]
[]
[]
[]
[]
[]
[]
[]
[]
[]
[]
[]
[]
[]
["Angebot"]

{"sheet":"QuickPlanning2","index":5,"n_rows":254,"n_cols":26,"rows_kept":254,"cut":false,"hidden":true,"merged":[[0,0,0,9]]}
["Schnellplanung für Ihr Projekt [BETA VERSION]"]
[null,null,null,null,null,null,null,null,null,null,null,null,"Erklärung:"]
[null,null,null,null,null,null,null,null,null,null,null,null,"Beginnen Sie Ihre Schnellplanung, indem Sie auf den grünen Button klicken. Dann geben Sie ihre Räume an und welche Kathegorien mit Loxone realisiert werden sollen. Sie können danach wie gewohnt die Main Seite fein abstimmen!"]
[]
[]
[]
[null,null,null,null,null,null,null,null,null,null,null,null,"Tipp:"]
[null,null,null,null,null,null,null,null,null,null,null,null,"Zeigen Sie dem Kunden was das Projekt kosten würde, wenn Sie Musik/Heizung/Beschattung auch realisieren!"]
[null,null,null,null,null,null,null,null,null,null,null,null,null,null,null,null,null,null,"Projekt "]
[null,null,null,null,null,null,null,null,null,null,null,null,null,null,null,null,null,null,"Projektname","Kunde XY"]
[null,null,null,null,null,null,null,null,null,null,null,null,null,null,null,null,null,null,"Kunde","Max Mustermann"]
[null,null,null,null,null,null,null,null,null,null,null,null,"Dieses Tool ist in der Beta Phase, ich würde mich über Feedback zu Performance, Funktion, Wünschen etc.  an die Partnerbetreuer sehr freuen!",null,null,null,null,null,"Adresse","Musterstraße 3"]
[null,null,null,null,null,null,null,null,null,null,null,null,null,null,null,null,null,null,"PLZ",1234]
[null,null,null,null,null,null,null,null,null,null,null,null,null,null,null,null,null,null,"Ort","Musterort"]
[]
[null,null,null,null,null,null,null,null,null,null,null,null,null,null,null,null,null,null,null,null,null,"Für mehrsprachig, immer die Werte referenzieren, nie direkt schreiben"]
[null,null,null,null,null,null,null,null,null,null,null,null,null,null,null,null,null,null,"Anzahl","Wohnzimmer Licht","Anzahl","Wohnzimmer Beschattung","Anzahl","Wohnzimmer Heizung","Anzahl","Wohnzimmer Musik"]
[null,null,null,null,null,null,null,null,null,null,null,null,null,null,null,null,null,null,1,{"$f":"Sensors!B22","v":"Motion Sensor Tree bilá"},8,{"$f":"Shading!B3","v":"Stínění"},2,{"$f":"Main!B21","v":"Hlavice Tree"},1,{"$f":"Music!B2","v":"Zóna Music Serveru"}]
[null,null,null,null,null,null,null,null,null,null,null,null,null,null,null,null,null,null,2,{"$f":"Tree!B5","v":"Touch Tree bílá"},null,null,null,null,2,{"$f":"Music!B8","v":"Loxone Speaker"}]
[null,null,null,null,null,null,null,null,null,null,null,null,null,null,null,null,null,null,1,{"$f":"Light!B12","v":"5m RGBW LED pásky IP20 (bez ochrany proti vodě)"},null,null,null,null,2,{"$f":"Music!B10","v":"Instalační box pro Loxone reproduktor (speaker)"}]
[null,null,null,null,null,null,null,null,null,null,null,null,null,null,null,null,null,null,12,{"$f":"Light!B20","v":"LED Spot WW"}]
[null,null,null,null,null,null,null,null,null,null,null,null,null,null,null,null,null,null,2,{"$f":"Light!B29","v":"RGBW 24V Dimmer Tree"}]
[]
[]
[]
[]
[]
[]
[]
[]
[]
["Kostenrechner"]
["Netto Liste",{"$f":"Products!G196","v":285462.48}]
["Partnerrabatt [%]",17]
["Netto Produkte",{"$f":"B33*(1-(B34/100))","v":236933.85839999997}]
["Interne Kosten",0.35,"(Programmierung, Installation, …)"]
["Netto Gesamt",{"$f":"B33*(1+B36)","v":385374.348}]
[]
[null,null,null,null,null,null,null,null,null,null,null,null,null,null,null,null,null,null,"Anzahl","Küche Licht","Anzahl","Küche Beschattung","Anzahl","Küche Heizung","Anzahl","Küche Musik"]
[null,null,null,null,null,null,null,null,null,null,null,null,null,null,null,null,null,null,1,{"$f":"Sensors!B22","v":"Motion Sensor Tree bilá"},4,{"$f":"Shading!B3","v":"Stínění"},1,{"$f":"Main!B21","v":"Hlavice Tree"},1,{"$f":"Music!B2","v":"Zóna Music Serveru"}]
["Allgemeine Kosten (Miniserver,…)",null,null,{"$f":"SUMIF(Products!R7:R188, \"R\", Products!G7:G188)/(1+Products!E197/100)","v":154672.48000000004},null,null,null,null,null,null,null,null,null,null,null,null,null,null,2,{"$f":"Tree!B5","v":"Touch Tree bílá"},null,null,null,null,2,{"$f":"Music!B8","v":"Loxone Speaker"}]
[null,null,null,null,null,null,null,null,null,null,null,null,null,null,null,null,null,null,9,{"$f":"Light!B20","v":"LED Spot WW"},null,null,null,null,2,{"$f":"Music!B10","v":"Instalační box pro Loxone reproduktor (speaker)"}]
["Licht",null,null,{"$f":"SUMIF(Products!R7:R188, \"L\", Products!G7:G188)/(1+Products!E197/100)","v":60104},null,null,null,null,null,null,null,null,null,null,null,null,null,null,2,{"$f":"Light!B29","v":"RGBW 24V Dimmer Tree"}]
[null,null,null,null,null,null,null,null,null,null,null,null,null,null,null,null,null,null,1,{"$f":"Light!B12","v":"5m RGBW LED pásky IP20 (bez ochrany proti vodě)"}]
["Beschattung",null,null,{"$f":"SUMIF(Products!R7:R188, \"B\", Products!G7:G188)/(1+Products!E197/100)","v":0}]
[]
["Heizung",null,null,{"$f":"SUMIF(Products!R7:R188, \"H\", Products!G7:G188)/(1+Products!E197/100)","v":10494}]
[]
["Musik",null,null,{"$f":"SUMIF(Products!R7:R188, \"M\", Products!G7:G188)/(1+Products!E197/100)","v":52993}]
[]
[]
[]
[]
[]
[]
[]
[]
[]
[]
[]
[null,null,null,null,null,null,null,null,null,null,null,null,null,null,null,null,null,null,"Anzahl","Bad EG Licht","Anzahl","Bad EG Beschattung","Anzahl","BadEG Heizung","Anzahl","Bad EG Musik"]
[null,null,null,null,null,null,null,null,null,null,null,null,null,null,null,null,null,null,2,"Bewegungsmelder Tree Weiß",3,"Beschattung (Rollo, Raffstore,...)",1,"Stellantrieb Tree",1,{"$f":"Music!B2","v":"Zóna Music Serveru"}]
[null,null,null,null,null,null,null,null,null,null,null,null,null,null,null,null,null,null,1,"Touch Tree Weiß",null,null,null,null,2,{"$f":"Music!B8","v":"Loxone Speaker"}]
[null,null,null,null,null,null,null,null,null,null,null,null,null,null,null,null,null,null,null,null,null,null,null,null,2,{"$f":"Music!B10","v":"Instalační box pro Loxone reproduktor (speaker)"}]
[]
[]
[]
[]
[]
[]
[]
[]
[]
[]
[]
[]
[]
[]
[]
[]
[]
[null,null,null,null,null,null,null,null,null,null,null,null,null,null,null,null,null,null,"Anzahl","Kizi1 Licht","Anzahl","Kizi1 Beschattung","Anzahl","Kizi1 Heizun","Anzahl","Kizi1 Musik"]
[null,null,null,null,null,null,null,null,null,null,null,null,null,null,null,null,null,null,2,"Bewegungsmelder Tree Weiß",3,"Beschattung (Rollo, Raffstore,...)",1,"Stellantrieb Tree",1,{"$f":"Music!B2","v":"Zóna Music Serveru"}]
[null,null,null,null,null,null,null,null,null,null,null,null,null,null,null,null,null,null,1,"Touch Tree Weiß",null,null,null,null,2,{"$f":"Music!B8","v":"Loxone Speaker"}]
[null,null,null,null,null,null,null,null,null,null,null,null,null,null,null,null,null,null,null,null,null,null,null,null,2,{"$f":"Music!B10","v":"Instalační box pro Loxone reproduktor (speaker)"}]
[]
[]
[]
[]
[]
[]
[]
[]
[]
[]
[]
[]
[]
[]
[]
[]
[]
[]
[null,null,null,null,null,null,null,null,null,null,null,null,null,null,null,null,null,null,"Anzahl","Kizi2 Licht","Anzahl","Kizi2 Beschattung","Anzahl","Kizi2 Heizun","Anzahl","Kizi2 Musik"]
[null,null,null,null,null,null,null,null,null,null,null,null,null,null,null,null,null,null,2,"Bewegungsmelder Tree Weiß",3,"Beschattung (Rollo, Raffstore,...)",1,"Stellantrieb Tree",1,{"$f":"Music!B2","v":"Zóna Music Serveru"}]
[null,null,null,null,null,null,null,null,null,null,null,null,null,null,null,null,null,null,1,"Touch Tree Weiß",null,null,null,null,2,{"$f":"Music!B8","v":"Loxone Speaker"}]
[null,null,null,null,null,null,null,null,null,null,null,null,null,null,null,null,null,null,null,null,null,null,null,null,2,"Loxone Speaker Einbaubox"]
[]
[]
[]
[]
[]
[]
[]
[]
[]
[]
[]
[]
[]
[]
[]
[]
[]
[null,null,null,null,null,null,null,null,null,null,null,null,null,null,null,null,null,null,"Anzahl","FlurDiele EG Licht","Anzahl","Flur Eg Beschattung","Anzahl","Flur Eg Heizung","Anzahl","Flur Eg Musik"]
[null,null,null,null,null,null,null,null,null,null,null,null,null,null,null,null,null,null,2,"Bewegungsmelder Tree Weiß",3,"Beschattung (Rollo, Raffstore,...)",1,"Stellantrieb Tree",1,{"$f":"Music!B2","v":"Zóna Music Serveru"}]
[null,null,null,null,null,null,null,null,null,null,null,null,null,null,null,null,null,null,1,"Touch Tree Weiß",null,null,null,null,2,{"$f":"Music!B8","v":"Loxone Speaker"}]
[null,null,null,null,null,null,null,null,null,null,null,null,null,null,null,null,null,null,null,null,null,null,null,null,2,{"$f":"Music!B10","v":"Instalační box pro Loxone reproduktor (speaker)"}]
[]
[]
[]
[]
[]
[]
[]
[]
[]
[]
[]
[]
[]
[]
[]
[]
[]
[null,null,null,null,null,null,null,null,null,null,null,null,null,null,null,null,null,null,"Anzahl","Eingang Licht","Anzahl","Eingang Beschattung","Anzahl","Eingang Heizung","Anzahl","Eingang Musik"]
[null,null,null,null,null,null,null,null,null,null,null,null,null,null,null,null,null,null,2,"Bewegungsmelder Tree Weiß",3,"Beschattung (Rollo, Raffstore,...)",1,"Stellantrieb Tree",1,{"$f":"Music!B2","v":"Zóna Music Serveru"}]
[null,null,null,null,null,null,null,null,null,null,null,null,null,null,null,null,null,null,1,"Touch Tree Weiß",null,null,null,null,2,{"$f":"Music!B8","v":"Loxone Speaker"}]
[null,null,null,null,null,null,null,null,null,null,null,null,null,null,null,null,null,null,null,null,null,null,null,null,2,{"$f":"Music!B10","v":"Instalační box pro Loxone reproduktor (speaker)"}]
[]
[]
[]
[]
[]
[]
[]
[]
[]
[]
[]
[]
[]
[]
[]
[]
[]
[null,null,null,null,null,null,null,null,null,null,null,null,null,null,null,null,null,null,"Anzahl","Schlazi Licht","Anzahl","Schlazi Beschattung","Anzahl","Schlazi Heizung","Anzahl","Schlazi Muik"]
[null,null,null,null,null,null,null,null,null,null,null,null,null,null,null,null,null,null,2,"Bewegungsmelder Tree Weiß",3,"Beschattung (Rollo, Raffstore,...)",1,"Stellantrieb Tree",1,{"$f":"Music!B2","v":"Zóna Music Serveru"}]
[null,null,null,null,null,null,null,null,null,null,null,null,null,null,null,null,null,null,1,"Touch Tree Weiß",null,null,null,null,2,{"$f":"Music!B8","v":"Loxone Speaker"}]
[null,null,null,null,null,null,null,null,null,null,null,null,null,null,null,null,null,null,null,null,null,null,null,null,2,{"$f":"Music!B10","v":"Instalační box pro Loxone reproduktor (speaker)"}]
[]
[]
[]
[]
[]
[]
[]
[]
[]
[]
[]
[]
[]
[]
[]
[]
[]
[null,null,null,null,null,null,null,null,null,null,null,null,null,null,null,null,null,null,"Anzahl","WC licht","Anzahl","WC beschattung","Anzahl","WC Heizung","Anzahl","WC Musik"]
[null,null,null,null,null,null,null,null,null,null,null,null,null,null,null,null,null,null,2,"Bewegungsmelder Tree Weiß",3,"Beschattung (Rollo, Raffstore,...)",1,"Stellantrieb Tree",1,{"$f":"Music!B2","v":"Zóna Music Serveru"}]
[null,null,null,null,null,null,null,null,null,null,null,null,null,null,null,null,null,null,1,"Touch Tree Weiß",null,null,null,null,2,{"$f":"Music!B8","v":"Loxone Speaker"}]
[null,null,null,null,null,null,null,null,null,null,null,null,null,null,null,null,null,null,null,null,null,null,null,null,2,{"$f":"Music!B10","v":"Instalační box pro Loxone reproduktor (speaker)"}]
[]
[]
[]
[]
[]
[]
[]
[]
[]
[]
[]
[]
[]
[]
[]
[]
[]
[null,null,null,null,null,null,null,null,null,null,null,null,null,null,null,null,null,null,"Anzahl","Bad OG Licht","Anzahl","Bad OG Beschattung","Anzahl","Bad OG Heizung","Anzahl","Bad OG Musik"]
[null,null,null,null,null,null,null,null,null,null,null,null,null,null,null,null,null,null,2,"Bewegungsmelder Tree Weiß",3,"Beschattung (Rollo, Raffstore,...)",1,"Stellantrieb Tree",1,"Musikserver Zonenauswahl"]
[null,null,null,null,null,null,null,null,null,null,null,null,null,null,null,null,null,null,1,"Touch Tree Weiß",null,null,null,null,2,{"$f":"Music!B8","v":"Loxone Speaker"}]
[null,null,null,null,null,null,null,null,null,null,null,null,null,null,null,null,null,null,null,null,null,null,null,null,2,{"$f":"Music!B10","v":"Instalační box pro Loxone reproduktor (speaker)"}]
[]
[]
[]
[]
[]
[]
[]
[]
[]
[]
[]
[]
[]
[]
[]
[]
[]
[null,null,null,null,null,null,null,null,null,null,null,null,null,null,null,null,null,null,"Anzahl","Flur OG Licht","Anzahl","Flur OG Beschattung","Anzahl","Flur OG Heizung","Anzahl","Flur OG Musik"]
[null,null,null,null,null,null,null,null,null,null,null,null,null,null,null,null,null,null,2,"Bewegungsmelder Tree Weiß",3,"Beschattung (Rollo, Raffstore,...)",1,"Stellantrieb Tree",1,{"$f":"Music!B2","v":"Zóna Music Serveru"}]
[null,null,null,null,null,null,null,null,null,null,null,null,null,null,null,null,null,null,1,"Touch Tree Weiß",null,null,null,null,2,{"$f":"Music!B8","v":"Loxone Speaker"}]
[null,null,null,null,null,null,null,null,null,null,null,null,null,null,null,null,null,null,null,null,null,null,null,null,2,{"$f":"Music!B10","v":"Instalační box pro Loxone reproduktor (speaker)"}]
[]
[]
[]
[]
[]
[]
[]
[]
[]
[]
[]
[]
[]
[]
[]
[]
[]
[null,null,null,null,null,null,null,null,null,null,null,null,null,null,null,null,null,null,"Anzahl","Garage Licht","Anzahl","Garage Beschattung","Anzahl","Garage Heizung","Anzahl","Garage Musik"]
[null,null,null,null,null,null,null,null,null,null,null,null,null,null,null,null,null,null,2,"Bewegungsmelder Tree Weiß",3,"Beschattung (Rollo, Raffstore,...)",1,"Stellantrieb Tree",1,{"$f":"Music!B2","v":"Zóna Music Serveru"}]
[null,null,null,null,null,null,null,null,null,null,null,null,null,null,null,null,null,null,1,"Touch Tree Weiß",null,null,null,null,2,{"$f":"Music!B8","v":"Loxone Speaker"}]
[null,null,null,null,null,null,null,null,null,null,null,null,null,null,null,null,null,null,null,null,null,null,null,null,2,{"$f":"Music!B10","v":"Instalační box pro Loxone reproduktor (speaker)"}]

{"sheet":"Sensors","index":6,"n_rows":30,"n_cols":5,"rows_kept":30,"cut":false,"hidden":true,"merged":[]}
["Artikelnummer+","Bezeichnung","Preis excl.","Preis Inkl.","Notiz"]
[200003,{"$f":"Products!D57","v":"Venkovní senzor teploty"},{"$f":"Products!E57","v":1032.23},{"$f":"Products!F57","v":1248.9983}]
[200006,{"$f":"Products!D60","v":"Vnitřní teplotní senzor 0-10V"},{"$f":"Products!E60","v":1032.23},{"$f":"Products!F60","v":1248.9983}]
[200010,{"$f":"Products!D62","v":"Senzor teploty a vlhkosti (vnitřní) 0-10V"},{"$f":"Products!E62","v":2189.2600000000002},{"$f":"Products!F62","v":2649.0046000000002}]
["200017",{"$f":"Products!D65","v":"Senzor CO2/Teplota/Vlhkost"},{"$f":"Products!E65","v":5784.3},{"$f":"Products!F65","v":6999.0029999999997}]
["200018",{"$f":"Products!D66","v":"Dešťový senzor (24V)"},{"$f":"Products!E66","v":1445.45},{"$f":"Products!F66","v":1748.9945}]
["200031",{"$f":"Products!D67","v":"Senzor teploty a vlhkosti (venkovní)"},{"$f":"Products!E67","v":2933.06},{"$f":"Products!F67","v":3549.0025999999998}]
["200032",{"$f":"Products!D68","v":"Senzor osvětlení 0-10V"},{"$f":"Products!E68","v":1982.64},{"$f":"Products!F68","v":2398.9944}]
["200033",{"$f":"VLOOKUP(Main!C2,Translating_general!A101:P118,10,FALSE)","v":"Senzor rychlosti větru 24V (s digitálním vstupem na Extensionu)"},{"$f":"Products!E69","v":1817.36},{"$f":"Products!F69","v":2199.0056}]
["200034",{"$f":"Products!D70","v":"Držák pro senzor větru"},{"$f":"Products!E70","v":1362.81},{"$f":"Products!F70","v":1649.0001}]
["200054",{"$f":"Products!D79","v":"Ultrazvukový senzor 0-10V"},{"$f":"Products!E79","v":5247.11},{"$f":"Products!F79","v":6349.003099999999}]
[200077,{"$f":"Products!D87","v":"1-Wire teplotní čip v pouzdře"},{"$f":"Products!E87","v":285.39999999999998},{"$f":"Products!F87","v":345.33399999999995}]
["200101",{"$f":"Products!D101","v":"Záplavový senzor"},{"$f":"Products!E101","v":425},{"$f":"Products!F101","v":514.25}]
[200109,{"$f":"Products!D103","v":"1-Wire teplotní senzor set"},{"$f":"Products!E103","v":1049},{"$f":"Products!F103","v":1269.29}]
["200112",{"$f":"Products!D105","v":"Senzor pohybu 24V (venkovní)"},{"$f":"Products!E105","v":2499},{"$f":"Products!F105","v":3023.79}]
[null,{"$f":"VLOOKUP(Main!C2,Translating_general!A101:P118,11,FALSE)","v":"Okenní kontakt (integrovaný v okně pouze DI)"}]
["200113",{"$f":"Products!D106","v":"Okenní kontakt"},{"$f":"Products!E106","v":259},{"$f":"Products!F106","v":313.39}]
["200136",{"$f":"Products!D109","v":"Saunový senzor teplota/vlhkost"},{"$f":"Products!E109","v":3999},{"$f":"Products!F109","v":4838.79}]
["200154",{"$f":"Products!D115","v":"Senzor tlaku 0-10V"},{"$f":"Products!E115","v":2849},{"$f":"Products!F115","v":3447.29}]
["200155",{"$f":"Products!D116","v":"Senzor rozbití okna 24V"},{"$f":"Products!E116","v":699},{"$f":"Products!F116","v":845.79}]
[null,{"$f":"Products!D158","v":"Pohybový senzor Tree anthrazit"}]
[null,{"$f":"Products!D153","v":"Motion Sensor Tree bilá"}]
[null,{"$f":"Products!D155","v":"Záplavový senzor Air"}]
[null,{"$f":"Products!D156","v":"Okenní a dveřní kontakt Air anthrazit"}]
[null,{"$f":"Products!D157","v":"Okenní a dveřní kontakt Air bílá"}]
[null,{"$f":"HLOOKUP(Main!$C$2,Translating_products!$DI$4:$DY$216,Translating_products!CM187, FALSE)","v":"Digital IN (Reserve)"}]
[null,{"$f":"HLOOKUP(Main!$C$2,Translating_products!$DI$4:$DY$216,Translating_products!CM188, FALSE)","v":"Analog IN (Reserve)"}]
[null,{"$f":"HLOOKUP(Main!$C$2,Translating_products!$DI$4:$DY$216,Translating_products!CM189, FALSE)","v":"Okenní klika Air"}]
[null,{"$f":"Products!D189","v":"Meteostanice Tree"}]
[null,{"$f":"Products!D190","v":"Meteostanice Air"}]

{"sheet":"Distributors","index":7,"n_rows":21,"n_cols":5,"rows_kept":21,"cut":false,"hidden":true,"merged":[]}
["Artikelnummer+","Bezeichnung","Preis excl.","Preis Inkl.","Notiz"]
["200168",{"$f":"Products!D120","v":"Svorka na DIN lištu PPV8 (20 kusů)"},{"$f":"Products!E120","v":5499},{"$f":"Products!F120","v":6653.79}]
["200169",{"$f":"Products!D121","v":"Propojovací rozvaděč PRV8 (20 kusů)"},{"$f":"Products!E121","v":5199},{"$f":"Products!F121","v":6290.79}]
["200170",{"$f":"VLOOKUP(Main!$C$2,Translating_general!$A$101:$AZ$118,21,FALSE)","v":"Předělovací deska PRV8 (10 ks)"},{"$f":"Products!E122","v":299},{"$f":"Products!F122","v":361.78999999999996}]
["200171",{"$f":"VLOOKUP(Main!$C$2,Translating_general!$A$101:$AZ$118,22,FALSE)","v":"Držák na značky pro PPV8/PRV8 (20ks)"},{"$f":"Products!E123","v":699},{"$f":"Products!F123","v":845.79}]
["200172",{"$f":"VLOOKUP(Main!$C$2,Translating_general!$A$101:$AZ$118,23,FALSE)","v":"Bočnice pro PPV8/PRV8 (10 ks)"},{"$f":"Products!E124","v":139},{"$f":"Products!F124","v":168.19}]
["200173",{"$f":"VLOOKUP(Main!$C$2,Translating_general!$A$101:$AZ$118,24,FALSE)","v":"Svorka na připojení motoru PMAK4 (50 ks)"},{"$f":"Products!E125","v":5299},{"$f":"Products!F125","v":6411.79}]
["200174",{"$f":"VLOOKUP(Main!$C$2,Translating_general!$A$101:$AZ$118,25,FALSE)","v":"Bočnice pro PMAK4 (20 ks)"},{"$f":"Products!E126","v":279},{"$f":"Products!F126","v":337.59}]
["200175",{"$f":"VLOOKUP(Main!$C$2,Translating_general!$A$101:$AZ$118,26,FALSE)","v":"Svorkovnice PDL (50ks)"},{"$f":"Products!E127","v":2799},{"$f":"Products!F127","v":3386.79}]
["200176",{"$f":"VLOOKUP(Main!$C$2,Translating_general!$A$101:$AZ$118,27,FALSE)","v":"Koncová podpěra svorkovnice ZEW (20 ks)"},{"$f":"Products!E128","v":199},{"$f":"Products!F128","v":240.79}]
["200177",{"$f":"VLOOKUP(Main!$C$2,Translating_general!$A$101:$AZ$118,28,FALSE)","v":"Bočnice pro PDL (20 ks)"},{"$f":"Products!E129","v":199},{"$f":"Products!F129","v":240.79}]
["200178",{"$f":"VLOOKUP(Main!$C$2,Translating_general!$A$101:$AZ$118,29,FALSE)","v":"Pojistková svorkovnice (25 ks)"},{"$f":"Products!E130","v":3399},{"$f":"Products!F130","v":4112.79}]
["200179",{"$f":"VLOOKUP(Main!$C$2,Translating_general!$A$101:$AZ$118,30,FALSE)","v":"Bočnice pojistkové svorkovnice (50 ks)"},{"$f":"Products!E131","v":449},{"$f":"Products!F131","v":543.29}]
["200180",{"$f":"VLOOKUP(Main!$C$2,Translating_general!$A$101:$AZ$118,31,FALSE)","v":"24 pólová propojka WEIDMÜLLER (10ks)"},{"$f":"Products!E132","v":1699},{"$f":"Products!F132","v":2055.79}]
["200181",{"$f":"VLOOKUP(Main!$C$2,Translating_general!$A$101:$AZ$118,32,FALSE)","v":"Pojistka 2A"},{"$f":"Products!E133","v":249},{"$f":"Products!F133","v":301.28999999999996}]
["200183",{"$f":"VLOOKUP(Main!$C$2,Translating_general!$A$101:$AZ$118,33,FALSE)","v":"Pojistka 5A (100ks)"},{"$f":"Products!E134","v":249},{"$f":"Products!F134","v":301.28999999999996}]
["200184",{"$f":"VLOOKUP(Main!$C$2,Translating_general!$A$101:$AZ$118,34,FALSE)","v":"Pojistka 10A (100ks)"},{"$f":"Products!E135","v":249},{"$f":"Products!F135","v":301.28999999999996}]
["200129",{"$f":"VLOOKUP(Main!$C$2,Translating_general!$A$101:$AZ$118,35,FALSE)","v":"Loxone CAT7 kabel (250m)"},{"$f":"Products!E107","v":4699},{"$f":"Products!F107","v":5685.79}]
["100150",{"$f":"Products!D35","v":"Loxone set nářadí"},{"$f":"Products!E35","v":8399},{"$f":"Products!F35","v":10162.789999999999}]
["200204",{"$f":"Products!D159","v":"20-ti pólová propojka Weidmuller (20 ks)"},{"$f":"Products!E159","v":2399},{"$f":"Products!F159","v":2902.79}]
[null,{"$f":"Products!D77","v":"Spojovací relé"}]

{"sheet":"Tree","index":8,"n_rows":18,"n_cols":2,"rows_kept":18,"cut":false,"hidden":true,"merged":[]}
[]
[]
[null,"Bezeichnung"]
[null,{"$f":"Products!D150","v":"Tree Extension"}]
[null,{"$f":"Products!D151","v":"Touch Tree bílá"}]
[null,{"$f":"Products!D152","v":"Touch Tree anthrazit"}]
[null,{"$f":"Products!D153","v":"Motion Sensor Tree bilá"}]
[null,{"$f":"Products!D154","v":"Hlavice Tree"}]
[null,{"$f":"Products!D158","v":"Pohybový senzor Tree anthrazit"}]
[null,{"$f":"Products!D164","v":"Touch pure Tree bílá"}]
[null,{"$f":"Products!D175","v":"Nano DI Tree"}]
[null,{"$f":"Products!D178","v":"Touch pure for Tree Anthracite"}]
[null,{"$f":"Products!D182","v":"Příložný LED Spot Tree RGBW bílá"}]
[null,{"$f":"Products!D183","v":"Příložný LED Spot Tree WW bílá"}]
[null,{"$f":"Products!D184","v":"LED Spot Tree WW bílá"}]
[null,{"$f":"Products!D185","v":"LED Spot Tree RGBW bílá"}]
[null,{"$f":"Products!D186","v":"RGBW 24V Dimmer Tree"}]
[null,{"$f":"Products!D189","v":"Meteostanice Tree"}]

{"sheet":"Wireless","index":9,"n_rows":40,"n_cols":5,"rows_kept":40,"cut":false,"hidden":true,"merged":[]}
["Artikelnummer+","Bezeichnung","Preis excl.","Preis Inkl.","Notiz"]
["100114",{"$f":"Products!D24","v":"Air Base Extension"},{"$f":"Products!E24","v":2099},{"$f":"Products!F24","v":2539.79}]
["100115",{"$f":"Products!D25","v":"Smart Socket Air Typ E"},{"$f":"Products!E25","v":1499},{"$f":"Products!F25","v":1813.79}]
["100116",{"$f":"Products!D26","v":"Multi Extension Air"},{"$f":"Products!E26","v":9916.5300000000007},{"$f":"Products!F26","v":11999.0013}]
["100139",{"$f":"Products!D30","v":"Miniserver Go"},{"$f":"Products!E30","v":8263.6299999999992},{"$f":"Products!F30","v":9998.9922999999981}]
["100140",{"$f":"Products!D31","v":"Remote Air"},{"$f":"Products!E31","v":1099},{"$f":"Products!F31","v":1329.79}]
["100141",{"$f":"Products!D32","v":"IR Control Air"},{"$f":"Products!E32","v":2499},{"$f":"Products!F32","v":3023.79}]
["100142",{"$f":"Products!D33","v":"Detektor kouře Air"},{"$f":"Products!E33","v":2049},{"$f":"Products!F33","v":2479.29}]
["100149",{"$f":"Products!D34","v":"Senzor teploty & vlhkosti Air"},{"$f":"Products!E34","v":1899},{"$f":"Products!F34","v":2297.79}]
["100151",{"$f":"Products!D36","v":"IR Elektroměr Air"},{"$f":"Products!E36","v":2099},{"$f":"Products!F36","v":2539.79}]
["100154",{"$f":"Products!D38","v":"Loxone Touch for Nano Bílá"},{"$f":"Products!E38","v":1049},{"$f":"Products!F38","v":1269.29}]
["100155",{"$f":"Products!D39","v":"Loxone Touch Air Bílá"},{"$f":"Products!E39","v":2499},{"$f":"Products!F39","v":3023.79}]
["100180",{"$f":"Products!D50","v":"Loxone Touch Air Anthrazit"},{"$f":"Products!E50","v":2499},{"$f":"Products!F50","v":3023.79}]
["100181",{"$f":"Products!D51","v":"Loxone Touch for Nano Anthrazit"},{"$f":"Products!E51","v":1049},{"$f":"Products!F51","v":1269.29}]
["100182",{"$f":"Products!D52","v":"Trubkový Motor SOLIDline Air 10Nm"},{"$f":"Products!E52","v":4499},{"$f":"Products!F52","v":5443.79}]
["100183",{"$f":"Products!D53","v":"Trubkový Motor SOLIDline Air 20Nm"},{"$f":"Products!E53","v":4999},{"$f":"Products!F53","v":6048.79}]
["100184",{"$f":"Products!D54","v":"Trubkový Motor SOLIDline Air 50Nm"},{"$f":"Products!E54","v":5799},{"$f":"Products!F54","v":7016.79}]
["100163",{"$f":"Products!D41","v":"Hlavice Air"},{"$f":"Products!E41","v":2099},{"$f":"Products!F41","v":2539.79}]
["200048",{"$f":"Products!D76","v":"SMA anténa 868 MHz"},{"$f":"Products!E76","v":371.9},{"$f":"Products!F76","v":449.99899999999997}]
["200151",{"$f":"Products!D113","v":"SMA Anténa 4dBi 868 MHz"},{"$f":"Products!E113","v":579},{"$f":"Products!F113","v":700.59}]
["100190",{"$f":"Products!D145","v":"Pohybový senzor Air"},{"$f":"Products!E145","v":2249},{"$f":"Products!F145","v":2721.29}]
["100153",{"$f":"Products!D37","v":"Nano IO Air"},{"$f":"Products!E37","v":2499},{"$f":"Products!F37","v":3023.79}]
["wird nicht verwendet",{"$f":"Products!D155","v":"Záplavový senzor Air"},"wird nicht verwendet","wird nicht verwendet"]
[null,{"$f":"Products!D156","v":"Okenní a dveřní kontakt Air anthrazit"}]
[null,{"$f":"Products!D157","v":"Okenní a dveřní kontakt Air bílá"}]
[null,{"$f":"Products!D162","v":"Touch pure Air bílá"}]
[null,{"$f":"Products!D163","v":"Touch pure for Nano bílá"}]
[null,{"$f":"Products!D166","v":"Nano Dimmer Air"}]
[null,{"$f":"Products!D179","v":"Touch pure Air Anthracite"}]
[null,{"$f":"Products!D177","v":"Touch pure for Nano Anthracite"}]
[null,{"$f":"HLOOKUP(Main!$C$2,Translating_products!$DI$4:$DY$216,Translating_products!CM189, FALSE)","v":"Okenní klika Air"}]
[null,{"$f":"Products!D190","v":"Meteostanice Air"}]
[null,{"$f":"Products!D192","v":"Žaluziový pohon GJ56 Air 6Nm kabel nahoře"}]
[]
[]
[]
["200059",{"$f":"Products!D81","v":"Enocean Bezdrátový okenní kontakt"},{"$f":"Products!E81","v":2149},{"$f":"Products!F81","v":2600.29}]
["200067",{"$f":"Products!D85","v":"EnOcean bezdrátová hlavice"},{"$f":"Products!E85","v":3799},{"$f":"Products!F85","v":4596.79}]
["200135",{"$f":"Products!D108","v":"Enocean Bezdrátový pohybový senzor"},{"$f":"Products!E108","v":4049},{"$f":"Products!F108","v":4899.29}]
["200137",{"$f":"Products!D110","v":"EnOcean bezdrátový aktor"},{"$f":"Products!E110","v":1999},{"$f":"Products!F110","v":2418.79}]

{"sheet":"Other","index":10,"n_rows":53,"n_cols":5,"rows_kept":53,"cut":false,"hidden":true,"merged":[]}
["Artikelnummer+","Bezeichnung","Preis excl.","Preis Inkl.","Kategorien_Sonstiges"]
["100004",{"$f":"Products!D9","v":"Rollup český"},{"$f":"Products!E9","v":2699},{"$f":"Products!F9","v":3265.79},"Fans&Partner"]
["100170",{"$f":"Products!D47","v":"not available in this country"},{"$f":"Products!E47","v":0},{"$f":"Products!F47","v":0},"Fans&Partner"]
["200050",{"$f":"Products!D78","v":"Loxone samolepky"},{"$f":"Products!E78","v":73.55},{"$f":"Products!F78","v":88.995499999999993},"Fans&Partner"]
["200086",{"$f":"Products!D88","v":"Loxone Fanshirt S"},{"$f":"Products!E88","v":285.39999999999998},{"$f":"Products!F88","v":345.33399999999995},"Fans&Partner"]
["200087",{"$f":"Products!D89","v":"Loxone Fanshirt M"},{"$f":"Products!E89","v":319},{"$f":"Products!F89","v":385.99},"Fans&Partner"]
["200088",{"$f":"Products!D90","v":"Loxone Fanshirt L"},{"$f":"Products!E90","v":319},{"$f":"Products!F90","v":385.99},"Fans&Partner"]
["200089",{"$f":"Products!D91","v":"Loxone Fanshirt XL"},{"$f":"Products!E91","v":319},{"$f":"Products!F91","v":385.99},"Fans&Partner"]
["200090",{"$f":"Products!D92","v":"Loxone Fanshirt XXL"},{"$f":"Products!E92","v":319},{"$f":"Products!F92","v":385.99},"Fans&Partner"]
["200158",{"$f":"Products!D119","v":"not available in this country"},{"$f":"Products!E119","v":0},{"$f":"Products!F119","v":0},"Fans&Partner"]
["200186",{"$f":"Products!D136","v":"Loxone brožurka - 25 kusů"},{"$f":"Products!E136","v":85},{"$f":"Products!F136","v":102.85},"Fans&Partner"]
["100008",{"$f":"Products!D10","v":"SD-Karta s firmwarem"},{"$f":"Products!E10","v":247.11},{"$f":"Products!F10","v":299.00310000000002},"Zubehör"]
["100023",{"$f":"Products!D16","v":"Neprodává se"},{"$f":"Products!E16","v":0},{"$f":"Products!F16","v":0},"Zubehör"]
["100025",{"$f":"Products!D17","v":"Weather Service 1 rok"},{"$f":"Products!E17","v":1238.8399999999999},{"$f":"Products!F17","v":1498.9963999999998},"Zubehör"]
["100026",{"$f":"Products!D18","v":"Weather Service 10 let"},{"$f":"Products!E18","v":7899},{"$f":"Products!F18","v":9557.7899999999991},"Zubehör"]
["100027",{"$f":"Products!D19","v":"Caller Service 1 rok"},{"$f":"Products!E19","v":1238.8399999999999},{"$f":"Products!F19","v":1498.9963999999998},"Zubehör"]
["100028",{"$f":"Products!D20","v":"Caller Service 10 let"},{"$f":"Products!E20","v":7899},{"$f":"Products!F20","v":9557.7899999999991},"Zubehör"]
["100035",{"$f":"Products!D22","v":"IR Set"},{"$f":"Products!E22","v":4131.3999999999996},{"$f":"Products!F22","v":4998.9939999999997},"Zubehör"]
["100178",{"$f":"Products!D48","v":"AquaStar Air 1.5\""},{"$f":"Products!E48","v":38999},{"$f":"Products!F48","v":47188.79},"Zubehör"]
["100179",{"$f":"Products!D49","v":"AquaStar Air 2\""},{"$f":"Products!E49","v":51999},{"$f":"Products!F49","v":62918.79},"Zubehör"]
["200001",{"$f":"Products!D55","v":"24V Zdroj (1.3A)"},{"$f":"Products!E55","v":908.26},{"$f":"Products!F55","v":1098.9946},"Zubehör"]
["200002",{"$f":"Products!D56","v":"24V Zdroj (4.2A)"},{"$f":"Products!E56","v":1404.13},{"$f":"Products!F56","v":1698.9973},"Zubehör"]
["200007",{"$f":"Products!D61","v":"not available in this country"},{"$f":"Products!E61","v":0},{"$f":"Products!F61","v":0},"Zubehör"]
["200012",{"$f":"Products!D63","v":"Adaptér ventilu VA80"},{"$f":"Products!E63","v":29.75},{"$f":"Products!F63","v":35.997500000000002},"Zubehör"]
["200013",{"$f":"Products!D64","v":"not available in this country"},{"$f":"Products!E64","v":0},{"$f":"Products!F64","v":0},"Zubehör"]
["200035",{"$f":"Products!D71","v":"24V Zdroj (10A)"},{"$f":"Products!E71","v":3304.96},{"$f":"Products!F71","v":3999.0016000000001},"Zubehör"]
["200040",{"$f":"Products!D72","v":"Instalační krabice IP20 bílá"},{"$f":"Products!E72","v":229},{"$f":"Products!F72","v":277.08999999999997},"Zubehör"]
["200049",{"$f":"Products!D77","v":"Spojovací relé"},{"$f":"Products!E77","v":396.69},{"$f":"Products!F77","v":479.99489999999997},"Zubehör"]
["200107",{"$f":"Products!D102","v":"not available in this country"},{"$f":"Products!E102","v":0},{"$f":"Products!F102","v":0},"Zubehör"]
["200143",{"$f":"Products!D111","v":"Zdroj 24V, 0,4A"},{"$f":"Products!E111","v":749},{"$f":"Products!F111","v":906.29},"Zubehör"]
["200156",{"$f":"Products!D117","v":"1-fázový elektroměr (Modbus)"},{"$f":"Products!E117","v":3799},{"$f":"Products!F117","v":4596.79},"Zubehör"]
["200157",{"$f":"Products!D118","v":"3-fázový elektroměr (Modbus)"},{"$f":"Products!E118","v":6799},{"$f":"Products!F118","v":8226.7899999999991},"Zubehör"]
[null,{"$f":"VLOOKUP(Main!C2,Translating_general!A101:P118,12,FALSE)","v":"Spotřebič do 5A"},null,null,"Zubehör"]
[null,{"$f":"VLOOKUP(Main!C2,Translating_general!A101:P118,13,FALSE)","v":"Spotřebič 5-16A"},null,null,"Zubehör"]
["200207",{"$f":"Products!D138","v":"Keba KeContact P20 Wallbox"},{"$f":"Products!E138","v":22999},{"$f":"Products!F138","v":27828.79},"Zubehör"]
["200161",{"$f":"Products!D142","v":"Napájecí zdroj do zásuvky 24V, 6,25A Typ E,F"},{"$f":"Products!E142","v":1799},{"$f":"Products!F142","v":2176.79},"Zubehör"]
["200281",{"$f":"Products!D146","v":"NFC Smart tagy"},{"$f":"Products!E146","v":629},{"$f":"Products!F146","v":761.09},"Zubehör"]
["200294",{"$f":"Products!D149","v":"Nabíjecí kabel typ 2"},{"$f":"Products!E149","v":8599},{"$f":"Products!F149","v":10404.789999999999},"Zubehör"]
[null,{"$f":"Products!D161","v":"Spínaný LED zdroj 24V 2,5A"},{"$f":"Products!E161","v":799},{"$f":"Products!F161","v":966.79},"Zubehör"]
[null,{"$f":"Products!D167","v":"Dvoužilový kroucený kabel modrá/bílá"}]
[null,{"$f":"Products!D168","v":"Dvoužilový kroucený kabel oranžová/bílá"}]
[null,{"$f":"Products!D169","v":"Dvoužilový kroucený kabel zelená/bílá"}]
[null,{"$f":"Products!D170","v":"Duracell Plus Power AA (12 ks)"}]
[null,{"$f":"Products!D171","v":"Duracell Plus Power AAA (12 ks)"}]
[null,{"$f":"Products!D172","v":"CR2032 Lithium Battery (20 ks)"}]
[null,{"$f":"Products!D173","v":"CR2450 Lithium Battery (20 ks)"}]
[null,{"$f":"Products!D174","v":"FDK 9V Lithium Battery"}]
[null,{"$f":"Products!D176","v":"not available in this country"}]
[]
["100011",{"$f":"Products!D11","v":"RS485 Extension"},{"$f":"Products!E11","v":3511.57},{"$f":"Products!F11","v":4248.9997000000003},"Zubehör"]
["100013",{"$f":"Products!D13","v":"RS 232 Extension"},{"$f":"Products!E13","v":3511.57},{"$f":"Products!F13","v":4248.9997000000003},"Zubehör"]
["100015",{"$f":"Products!D15","v":"Enocean Extension"},{"$f":"Products!E15","v":6197.52},{"$f":"Products!F15","v":7498.9992000000002},"Zubehör"]
["100124",{"$f":"Products!D28","v":"Modbus Extension"},{"$f":"Products!E28","v":4799},{"$f":"Products!F28","v":5806.79},"Zubehör"]

{"sheet":"Shading","index":11,"n_rows":12,"n_cols":6,"rows_kept":12,"cut":false,"hidden":true,"merged":[]}
["Artikelnummer+","Bezeichnung","Preis excl.","Preis Inkl.","Notiz"]
[100153,{"$f":"Products!D37","v":"Nano IO Air"},{"$f":"Products!E37","v":2499},{"$f":"Products!F37","v":3023.79},null,"Rollo per Kabel zu NANO IO und Nano zu AirBase per Funk"]
[null,{"$f":"VLOOKUP(Main!C2,Translating_general!A101:P118,14,FALSE)","v":"Stínění"},null,null,null,"pro Rollo/Markise/Jalousie/Raffstore 1 Nano"]
["100182",{"$f":"Products!D52","v":"Trubkový Motor SOLIDline Air 10Nm"},{"$f":"Products!E52","v":4499},{"$f":"Products!F52","v":5443.79},null,"1 Nano belegt 1 Kanal auf AirBase"]
["100183",{"$f":"Products!D53","v":"Trubkový Motor SOLIDline Air 20Nm"},{"$f":"Products!E53","v":4999},{"$f":"Products!F53","v":6048.79}]
["100184",{"$f":"Products!D54","v":"Trubkový Motor SOLIDline Air 50Nm"},{"$f":"Products!E54","v":5799},{"$f":"Products!F54","v":7016.79}]
[null,{"$f":"Products!D189","v":"Meteostanice Tree"}]
[null,{"$f":"Products!D190","v":"Meteostanice Air"}]
[null,{"$f":"Products!D192","v":"Žaluziový pohon GJ56 Air 6Nm kabel nahoře"}]
[null,{"$f":"Products!D193","v":"Žaluziový pohon GJ56 Air 20Nm kabel nahoře"}]
[null,{"$f":"Products!D194","v":"Žaluziový pohon GJ56 Air 6Nm kabel dole"}]
[null,{"$f":"Products!D195","v":"Žaluziový pohon GJ56 Air 20Nm kabel dole"}]

{"sheet":"Switch","index":12,"n_rows":18,"n_cols":7,"rows_kept":18,"cut":false,"hidden":true,"merged":[]}
["Artikelnummer+","Bezeichnung","Preis excl.","Preis Inkl.","Notiz"]
[null,{"$f":"VLOOKUP(Main!$C$2,Translating_general!$A$101:$T$118,16,FALSE)","v":"1 Tlačítko"},null,null,"Kabeltaster"]
[null,{"$f":"VLOOKUP(Main!$C$2,Translating_general!$A$101:$T$118,17,FALSE)","v":"2 Tlačítko"},null,null,"Kabeltaster",null,"taster belegen nur Eingänge"]
[null,{"$f":"VLOOKUP(Main!$C$2,Translating_general!$A$101:$T$118,18,FALSE)","v":"4 Tlačítko"},null,null,"Kabeltaster"]
[null,{"$f":"VLOOKUP(Main!$C$2,Translating_general!$A$101:$T$118,19,FALSE)","v":"5 Tlačítko"},null,null,"Kabeltaster"]
["100154",{"$f":"Products!D38","v":"Loxone Touch for Nano Bílá"},{"$f":"Products!E38","v":1049},{"$f":"Products!F38","v":1269.29},"Funktaster"]
["100155",{"$f":"Products!D39","v":"Loxone Touch Air Bílá"},{"$f":"Products!E39","v":2499},{"$f":"Products!F39","v":3023.79},"Funktaster"]
[200057,{"$f":"Products!D80","v":"Enocean Bezdrátové tlačítko"},{"$f":"Products!E80","v":1249},{"$f":"Products!F80","v":1511.29},"Funktaster"]
["100180",{"$f":"Products!D50","v":"Loxone Touch Air Anthrazit"},{"$f":"Products!E50","v":2499},{"$f":"Products!F50","v":3023.79},"Funktaster"]
["100181",{"$f":"Products!D51","v":"Loxone Touch for Nano Anthrazit"},{"$f":"Products!E51","v":1049},{"$f":"Products!F51","v":1269.29},"Funktaster"]
[null,{"$f":"Products!D151","v":"Touch Tree bílá"}]
[null,{"$f":"Products!D152","v":"Touch Tree anthrazit"}]
[null,{"$f":"Products!D162","v":"Touch pure Air bílá"}]
[null,{"$f":"Products!D163","v":"Touch pure for Nano bílá"}]
[null,{"$f":"Products!D164","v":"Touch pure Tree bílá"}]
[null,{"$f":"Products!D177","v":"Touch pure for Nano Anthracite"}]
[null,{"$f":"Products!D178","v":"Touch pure for Tree Anthracite"}]
[null,{"$f":"Products!D179","v":"Touch pure Air Anthracite"}]

{"sheet":"Ms&Extensions","index":13,"n_rows":19,"n_cols":5,"rows_kept":19,"cut":false,"hidden":true,"merged":[]}
["Artikelnummer+","Bezeichnung","Preis excl.","Preis Inkl.","Notiz"]
["100001",{"$f":"Products!D7","v":"Miniserver"},{"$f":"Products!E7","v":10329.75},{"$f":"Products!F7","v":12498.997499999999}]
["100002",{"$f":"Products!D8","v":"Extension"},{"$f":"Products!E8","v":8263.64},{"$f":"Products!F8","v":9999.0043999999998}]
["100011",{"$f":"Products!D11","v":"RS485 Extension"},{"$f":"Products!E11","v":3511.57},{"$f":"Products!F11","v":4248.9997000000003}]
["100012",{"$f":"Products!D12","v":"DMX Extension"},{"$f":"Products!E12","v":5619.01},{"$f":"Products!F12","v":6799.0020999999997}]
["100013",{"$f":"Products!D13","v":"RS 232 Extension"},{"$f":"Products!E13","v":3511.57},{"$f":"Products!F13","v":4248.9997000000003}]
["100014",{"$f":"Products!D14","v":"1-Wire Extension"},{"$f":"Products!E14","v":3511.57},{"$f":"Products!F14","v":4248.9997000000003}]
["100015",{"$f":"Products!D15","v":"Enocean Extension"},{"$f":"Products!E15","v":6197.52},{"$f":"Products!F15","v":7498.9992000000002}]
[100124,{"$f":"Products!D28","v":"Modbus Extension"},{"$f":"Products!E28","v":4799},{"$f":"Products!F28","v":5806.79}]
["100029",{"$f":"Products!D21","v":"Dimmer Extension"},{"$f":"Products!E21","v":9338.02},{"$f":"Products!F21","v":11299.004199999999}]
["100038",{"$f":"Products!D23","v":"Relay Extension"},{"$f":"Products!E23","v":9916.5300000000007},{"$f":"Products!F23","v":11999.0013}]
["100114",{"$f":"Products!D24","v":"Air Base Extension"},{"$f":"Products!E24","v":2099},{"$f":"Products!F24","v":2539.79}]
["100116",{"$f":"Products!D26","v":"Multi Extension Air"},{"$f":"Products!E26","v":9916.5300000000007},{"$f":"Products!F26","v":11999.0013}]
["100139",{"$f":"Products!D30","v":"Miniserver Go"},{"$f":"Products!E30","v":8263.6299999999992},{"$f":"Products!F30","v":9998.9922999999981}]
["100158",{"$f":"Products!D40","v":"Fröling Extension"},{"$f":"Products!E40","v":4499},{"$f":"Products!F40","v":5443.79}]
[null,{"$f":"Products!D150","v":"Tree Extension"}]
[null,{"$f":"Products!D160","v":"Dali Extension"}]
[null,{"$f":"Products!D165","v":"Internorm Extension"}]
[null,{"$f":"Products!D188","v":"DI Extension"}]

{"sheet":"Main","index":14,"n_rows":107,"n_cols":49,"rows_kept":107,"cut":false,"hidden":false,"merged":[[1,4,1,40],[80,0,89,0],[91,0,100,0],[40,0,49,0],[102,0,106,0],[63,0,71,0],[58,0,61,0],[51,0,56,0],[75,0,78,0],[20,0,24,0],[26,0,31,0],[4,0,14,0],[16,0,18,0],[1,2,1,3],[33,0,38,0]]}
[null,null,null,1]
[null,"Language / Country","CZ",null,{"$f":"VLOOKUP(C2,Translating_general!A5:P22,3,FALSE)","v":"Místnosti"}]
["Version 2.8.8",{"$f":"VLOOKUP(C2,Translating_general!A5:P22,3,FALSE)","v":"Místnosti"},{"$f":"VLOOKUP(C2,Translating_general!A5:B17,2,FALSE)","v":"Počet"},"Entrance room","Living Room","Kitchen","Bedroom","Hall","Bathroom","Technical room","Terrace","Entrance","Outside"]
[null,{"$f":"VLOOKUP(C2,Translating_general!A5:Q22,17,FALSE)","v":"Rozbalovací menu"}]
[{"$f":"VLOOKUP(C2,Translating_general!A5:P22,4,FALSE)","v":"Světlo"},{"$f":"Light!B18","v":"Světelný okruh 5A"},{"$f":"SUM(D5:AR5)","v":3},null,1,null,null,null,null,null,1,1,null,null,null,null,null,null,null,null,null,null,null,null,null,null,null,null,null,null,null,null,null,null,null,null,null,null,null,null,null,null,null,null,null,null,null,null,"There are drop down menues!"]
[null,{"$f":"Light!B20","v":"LED Spot WW"},{"$f":"SUM(D6:AR6)","v":24},3,null,6,6,2,4,3]
[null,{"$f":"Light!B19","v":"LED Spot RGBW"},9,null,9]
[null,{"$f":"Light!B12","v":"5m RGBW LED pásky IP20 (bez ochrany proti vodě)"},4,1,1,1,1]
[null,{"$f":"Light!B29","v":"RGBW 24V Dimmer Tree"},9,1,3,2,1,1,1]
[null,{"$f":"Light!B30","v":"Krabice do betonu pro LED spot"},0]
[null,null,0]
[null,null,0]
[null,null,0]
[null,null,0]
[null,null,{"$f":"SUM(D15:AR15)","v":0}]
[]
[{"$f":"VLOOKUP(C2,Translating_general!A5:P22,5,FALSE)","v":"Stínění"},{"$f":"Shading!B11","v":"Žaluziový pohon GJ56 Air 6Nm kabel dole"},{"$f":"SUM(D17:AO17)","v":0}]
[null,{"$f":"Shading!B7","v":"Meteostanice Tree"},{"$f":"SUM(D18:AO18)","v":1},null,null,null,null,null,null,null,null,null,1]
[null,{"$f":"Shading!B3","v":"Stínění"},8,null,3,1,2,null,1,1]
[]
[{"$f":"VLOOKUP(C2,Translating_general!A5:P22,6,FALSE)","v":"Topení"},{"$f":"Heating!B11","v":"Hlavice Tree"},{"$f":"SUM(D21:AO21)","v":6},1,2,1,1,null,1]
[null,{"$f":"Heating!B4","v":"Hlavice Air"},{"$f":"SUM(D22:AO22)","v":0}]
[null,{"$f":"Heating!B10","v":"1-Wire teplotní senzor"},0]
[null,null,0]
[null,null,0]
[]
[{"$f":"VLOOKUP(C2,Translating_general!A5:P22,7,FALSE)","v":"Sensor"},{"$f":"Sensors!B15","v":"Senzor pohybu 24V (venkovní)"},{"$f":"SUM(D27:AO27)","v":2},null,null,null,null,null,null,null,1,1]
[null,{"$f":"Sensors!B16","v":"Okenní kontakt (integrovaný v okně pouze DI)"},{"$f":"SUM(D28:AO28)","v":7},null,1,1,2,null,1,1,null,1]
[null,{"$f":"Sensors!B26","v":"Digital IN (Reserve)"},0]
[null,{"$f":"Sensors!B27","v":"Analog IN (Reserve)"},0]
[null,{"$f":"Sensors!B29","v":"Meteostanice Tree"},0]
[null,{"$f":"Wireless!B31","v":"Okenní klika Air"},0]
[]
[{"$f":"VLOOKUP(C2,Translating_general!A5:P22,16,FALSE)","v":"Tree"},{"$f":"Tree!B7","v":"Motion Sensor Tree bilá"},{"$f":"SUM(D34:AO34)","v":7},1,2,1,null,1,1,1]
[null,{"$f":"Tree!B11","v":"Nano DI Tree"},{"$f":"SUM(D35:AO35)","v":0}]
[null,{"$f":"Tree!B9","v":"Pohybový senzor Tree anthrazit"},0]
[null,{"$f":"Tree!B18","v":"Meteostanice Tree"},0]
[null,null,0]
[null,null,0]
[]
[{"$f":"VLOOKUP(C2,Translating_general!A5:P22,8,FALSE)","v":"Air"},{"$f":"Wireless!B21","v":"Pohybový senzor Air"},{"$f":"SUM(D41:AO41)","v":1},null,null,null,1]
[null,{"$f":"Wireless!B8","v":"Detektor kouře Air"},{"$f":"SUM(D42:AO42)","v":3},1,1,null,1]
[null,{"$f":"Wireless!B6","v":"Remote Air"},1,null,1]
[null,{"$f":"Wireless!B3","v":"Smart Socket Air Typ E"},2,null,1,null,1]
[null,{"$f":"Wireless!B23","v":"Záplavový senzor Air"},1,null,null,null,null,null,null,1]
[null,null,0]
[null,null,0]
[null,null,0]
[null,null,0]
[null,null,{"$f":"SUM(D50:AO50)","v":0}]
[]
[{"$f":"VLOOKUP(C2,Translating_general!A5:P22,9,FALSE)","v":"Tlačítka"},{"$f":"Switch!B15","v":"Touch pure Tree bílá"},{"$f":"SUM(D52:AO52)","v":4},1,2,1]
[null,{"$f":"Switch!B11","v":"Touch Tree bílá"},{"$f":"SUM(D53:AO53)","v":5},null,null,null,3,null,1,1]
[null,null,{"$f":"SUM(D54:AO54)","v":0}]
[null,null,{"$f":"SUM(D55:AR55)","v":0}]
[null,null,0]
[null,null,0]
[]
[{"$f":"VLOOKUP(C2,Translating_general!A5:P22,10,FALSE)","v":"Přístup"},{"$f":"Entry!B9","v":"Loxone Intercom XL"},{"$f":"SUM(D59:AO59)","v":1},null,null,null,null,null,null,null,null,null,1]
[null,{"$f":"Entry!B6","v":"Zapuštěný box pro Loxone Intercom"},{"$f":"SUM(D60:AO60)","v":1},null,null,null,null,null,null,null,null,null,1]
[null,{"$f":"Entry!B3","v":"Elektronický klíč"},5,null,null,null,null,null,null,null,null,null,5]
[null,{"$f":"Entry!B4","v":"Elektronický klíč (Magnetický)"},0]
[]
[{"$f":"VLOOKUP(C2,Translating_general!A5:P22,11,FALSE)","v":"Hudba"},{"$f":"Music!B2","v":"Zóna Music Serveru"},{"$f":"SUM(D64:AO64)","v":1},null,null,null,null,null,null,1]
[null,{"$f":"Music!B8","v":"Loxone Speaker"},{"$f":"SUM(D65:AO65)","v":5},null,null,1,1,null,1,null,2]
[null,{"$f":"Music!B9","v":"Loxone 12ti kanálový zesilovač"},1,null,null,null,null,null,null,1]
[null,{"$f":"Music!B10","v":"Instalační box pro Loxone reproduktor (speaker)"},0]
[null,{"$f":"Music!B12","v":"Loxone Speaker back box pro snížené stropy"},5,null,null,1,1,null,1,null,2]
[null,null,0]
[null,null,0]
[null,null,0]
[null,null,0]
[null,null,0]
[]
[]
[{"$f":"VLOOKUP(C2,Translating_general!A5:P22,12,FALSE)","v":"Miniserver&Extension"},{"$f":"'Ms&Extensions'!B6","v":"RS 232 Extension"},{"$f":"SUM(D76:AO76)","v":0}]
[null,{"$f":"'Ms&Extensions'!B4","v":"RS485 Extension"},{"$f":"SUM(D77:AO77)","v":0}]
[null,{"$f":"'Ms&Extensions'!B19","v":"DI Extension"},0]
[null,null,0]
[]
[{"$f":"VLOOKUP(C2,Translating_general!A5:P22,13,FALSE)","v":"Rozvaděč"},{"$f":"Distributors!B18","v":"Loxone CAT7 kabel (250m)"},{"$f":"SUM(D81:AO81)","v":0}]
[null,{"$f":"Distributors!B7","v":"Svorka na připojení motoru PMAK4 (50 ks)"},{"$f":"SUM(D82:AO82)","v":0}]
[null,null,0]
[null,null,0]
[null,null,0]
[null,null,0]
[null,null,0]
[null,null,0]
[null,null,0]
[null,null,0]
[]
[{"$f":"VLOOKUP(C2,Translating_general!A5:P22,14,FALSE)","v":"Příslušenství"},{"$f":"Other!B34","v":"Spotřebič 5-16A"},{"$f":"SUM(D92:AO92)","v":7},null,2,2,null,null,null,2,1]
[null,{"$f":"Other!B33","v":"Spotřebič do 5A"},{"$f":"SUM(D93:AO93)","v":3},null,null,null,null,null,1,1,null,1]
[null,{"$f":"Other!B17","v":"Caller Service 10 let"},1,null,null,null,null,null,null,null,null,1]
[null,null,0]
[null,null,0]
[null,null,0]
[null,null,0]
[null,null,0]
[null,null,0]
[null,null,0]
[]
[{"$f":"VLOOKUP(C2,Translating_general!A5:P22,15,FALSE)","v":"Fanoušci a Partneři"},{"$f":"Other!B11","v":"Loxone brožurka - 25 kusů"},{"$f":"SUM(D103:AO103)","v":0}]
[null,{"$f":"Other!B2","v":"Rollup český"},{"$f":"SUM(D104:AO104)","v":0}]
[null,{"$f":"Other!B3","v":"not available in this country"},0]
[null,null,0]
[null,null,0]

{"sheet":"Power","index":15,"n_rows":76,"n_cols":25,"rows_kept":76,"cut":false,"hidden":false,"merged":[[2,1,3,5],[8,1,8,5],[30,1,30,5],[50,1,50,5]]}
[]
[]
[null,{"$f":"VLOOKUP(Main!C2,Translating_general!A29:P46,2,FALSE)","v":"Výpočet zdroje"}]
[]
[]
[null,{"$f":"VLOOKUP(Main!C2,Translating_general!A29:P46,3,FALSE)","v":"Zdroje"},"0,4 A","1,3 A","4,2 A","10 A"]
[null,null,{"$f":"W12","v":0},{"$f":"W13","v":2},{"$f":"W14","v":1},{"$f":"W15","v":2}]
[]
[null,{"$f":"VLOOKUP(Main!C2,Translating_general!A29:P46,4,FALSE)","v":"Extensiony"},null,null,null,null,null,null,null,null,null,null,null,null,null,null,null,null,null,null,null,null,null,{"$f":"VLOOKUP(Main!C2,Translating_general!A29:P46,4,FALSE)","v":"Extensiony"}]
[null,{"$f":"VLOOKUP(Main!C2,Translating_general!A29:P46,5,FALSE)","v":"Číslo produktu"},{"$f":"VLOOKUP(Main!C2,Translating_general!A29:P46,6,FALSE)","v":"Produkty"},{"$f":"VLOOKUP(Main!C2,Translating_general!A29:P46,7,FALSE)","v":"Počet"},{"$f":"VLOOKUP(Main!C2,Translating_general!A29:P46,8,FALSE)","v":"Ampér/jednotku"},{"$f":"VLOOKUP(Main!C2,Translating_general!A29:P46,9,FALSE)","v":"Celkem"},null,null,null,null,null,null,null,null,null,null,null,null,null,null,null,null,null,{"$f":"VLOOKUP(Main!C2,Translating_general!A29:P46,10,FALSE)","v":"Zbývající Ampéry"},{"$f":"W19*1.3+W20*4.2","v":1.3}]
[null,"100001",{"$f":"Calculation!B414","v":"Miniserver"},{"$f":"Products!B7","v":1},{"$f":"Calculation!D414","v":0.12},{"$f":"D11*E11","v":0.12},null,null,null,null,null,null,null,null,null,null,null,null,null,null,null,"Gesamt",null,{"$f":"VLOOKUP(Main!C2,Translating_general!A29:P46,11,FALSE)","v":"Potřebné Ampéry"},{"$f":"F26","v":0.73080000000000001}]
[null,"100002",{"$f":"Calculation!B415","v":"Extension"},{"$f":"Products!B8","v":0},{"$f":"Calculation!D415","v":0.06},{"$f":"D12*E12","v":0},null,null,null,null,null,null,null,null,null,null,null,null,null,null,null,"0,4A Netzteil",{"$f":"D28","v":0}]
[null,"100011",{"$f":"Calculation!B416","v":"RS485 Extension"},{"$f":"Products!B11","v":0},{"$f":"Calculation!D416","v":0.03},0,null,null,null,null,null,null,null,null,null,null,null,null,null,null,null,"1,3A Netzteil",{"$f":"W19+W55","v":2}]
[null,"100012",{"$f":"Calculation!B417","v":"DMX Extension"},{"$f":"Products!B12","v":0},{"$f":"Calculation!D417","v":0.03},0,null,null,null,null,null,null,null,null,null,null,null,null,null,null,null,"4,2A Netzteil",{"$f":"W20+W34+W56","v":1}]
[null,"100013",{"$f":"Calculation!B418","v":"RS 232 Extension"},{"$f":"Products!B13","v":0},{"$f":"Calculation!D418","v":0.03},0,null,null,null,null,null,null,null,null,null,null,null,null,null,null,null,"10A Netzteil",{"$f":"W35+W57","v":2}]
[null,"100014",{"$f":"Calculation!B419","v":"1-Wire Extension"},{"$f":"Products!B14","v":0},{"$f":"Calculation!D419","v":0.03},0]
[null,"100015",{"$f":"Calculation!B420","v":"Enocean Extension"},{"$f":"Products!B15","v":0},{"$f":"Calculation!D420","v":0.03},0]
[null,"100029",{"$f":"Calculation!B421","v":"Dimmer Extension"},{"$f":"Products!B21","v":0},{"$f":"Calculation!D421","v":0.06},0]
[null,"100035",{"$f":"Calculation!B422","v":"IR Set"},{"$f":"Products!B22","v":0},{"$f":"Calculation!D422","v":0.03},0,null,null,null,null,null,null,null,null,null,null,null,null,null,null,null,"1,3A Netzteil",{"$f":"IF((F26-W20*4.2)<4.2,ROUNDUP((F26-W20*4.2)/1.3,0),0)","v":1}]
[null,"100038",{"$f":"Calculation!B423","v":"Relay Extension"},{"$f":"Products!B23","v":2},{"$f":"Calculation!D423","v":0.3},0.6,null,null,null,null,null,null,null,null,null,null,null,null,null,null,null,"4,2A Netzteil",{"$f":"ROUNDDOWN(F26/4.2,0)","v":0}]
[null,"100114",{"$f":"Calculation!B424","v":"Air Base Extension"},{"$f":"Products!B24","v":1},{"$f":"Calculation!D424","v":6.0000000000000001E-3},6.0000000000000001E-3]
[null,"100124",{"$f":"Calculation!B425","v":"Modbus Extension"},{"$f":"Products!B28","v":0},{"$f":"Calculation!D425","v":0.03},{"$f":"D22*E22","v":0}]
[null,"100158",{"$f":"Calculation!B426","v":"Fröling Extension"},{"$f":"Products!B40","v":0},{"$f":"Calculation!D426","v":0.03},{"$f":"D23*E23","v":0}]
[null,{"$f":"Products!C150","v":100218},{"$f":"Calculation!B427","v":"Tree Extension"},{"$f":"Products!B150","v":1},{"$f":"Products!O150","v":4.7999999999999996E-3},{"$f":"D24*E24","v":4.7999999999999996E-3}]
[null,{"$f":"Products!C160","v":100200},{"$f":"Products!D160","v":"Dali Extension"},{"$f":"Products!B160","v":0},0.13400000000000001,{"$f":"D25*E25","v":0}]
[null,null,null,null,{"$f":"VLOOKUP(Main!C2,Translating_general!A29:P46,12,FALSE)","v":"Celkem"},{"$f":"SUM(F11:O25)","v":0.73080000000000001}]
[]
[null,"100116",{"$f":"Calculation!B432","v":"Multi Extension Air"},null,{"$f":"VLOOKUP(Main!C2,Translating_general!A29:P46,15,FALSE)","v":"0,4 Ampérový zdroj / jednotka"},null,null,null,null,null,null,null,null,null,null,null,null,null,null,null,null,"0,4A Netzteil",{"$f":"D28","v":0}]
[]
[]
[null,{"$f":"VLOOKUP(Main!C2,Translating_general!A29:P46,13,FALSE)","v":"LED"},null,null,null,null,null,null,null,null,null,null,null,null,null,null,null,null,null,null,null,null,null,{"$f":"VLOOKUP(Main!C2,Translating_general!A29:P46,13,FALSE)","v":"LED"}]
[null,{"$f":"VLOOKUP(Main!C2,Translating_general!A29:P46,5,FALSE)","v":"Číslo produktu"},{"$f":"VLOOKUP(Main!C2,Translating_general!A29:P46,6,FALSE)","v":"Produkty"},{"$f":"VLOOKUP(Main!C2,Translating_general!A29:P46,7,FALSE)","v":"Počet"},{"$f":"VLOOKUP(Main!C2,Translating_general!A29:P46,8,FALSE)","v":"Ampér/jednotku"},{"$f":"VLOOKUP(Main!C2,Translating_general!A29:P46,9,FALSE)","v":"Celkem"},null,null,null,null,null,null,null,null,null,null,null,null,null,null,null,null,null,{"$f":"VLOOKUP(Main!C2,Translating_general!A29:P46,10,FALSE)","v":"Zbývající Ampéry"},{"$f":"W34*4.2+W35*10","v":24.2}]
[null,"200042",{"$f":"Calculation!B434","v":"5m RGB LED pásky IP20 (bez ochrany proti vodě)"},{"$f":"Products!B73","v":0},{"$f":"Calculation!D434","v":3},{"$f":"D33*E33","v":0},null,null,null,null,null,null,null,null,null,null,null,null,null,null,null,null,null,{"$f":"VLOOKUP(Main!C2,Translating_general!A29:P46,11,FALSE)","v":"Potřebné Ampéry"},{"$f":"F49","v":21}]
[null,"200043",{"$f":"Calculation!B435","v":"5m LED pásky (teplá bílá) - IP20 (bez ochrany proti vodě)"},{"$f":"Products!B74","v":0},{"$f":"Calculation!D435","v":3},0,null,null,null,null,null,null,null,null,null,null,null,null,null,null,null,"4,2A Netzteil",{"$f":"IF((F49-W35*10)<10,ROUNDUP((F49-W35*10)/4.2,0),0)","v":1}]
[null,"200046",{"$f":"Calculation!B437","v":"5m RGB LED pásky IP68 (proti potopení do vody)"},{"$f":"Products!B75","v":0},{"$f":"Calculation!D437","v":3},0,null,null,null,null,null,null,null,null,null,null,null,null,null,null,null,"10A Netzteil",{"$f":"ROUNDDOWN(F49/10,0)","v":2}]
[null,"200061",{"$f":"Calculation!B438","v":"5m LED pásky (teplá bílá) - IP65 (proti tryskající vodě)"},{"$f":"Products!B82","v":0},{"$f":"Calculation!D438","v":3},0]
[null,"200092",{"$f":"Calculation!B439","v":"5m LED pásky (teplá bílá) - IP68 (proti potopení do vody)"},{"$f":"Products!B93","v":0},{"$f":"Calculation!D439","v":3},0]
[null,"200098",{"$f":"Calculation!B440","v":"5m RGBW LED pásky IP20 (bez ochrany proti vodě)"},{"$f":"Products!B98","v":4},{"$f":"Calculation!D440","v":3.6},14.4]
[null,"200099",{"$f":"Calculation!B441","v":"5m RGBW LED pásky IP65 (proti tryskající vodě)"},{"$f":"Products!B99","v":0},{"$f":"Calculation!D441","v":3.6},0]
[null,"200100",{"$f":"Calculation!B442","v":"5m RGBW LED pásky IP68 (proti potopení do vody)"},{"$f":"Products!B100","v":0},{"$f":"Calculation!D442","v":3.6},0]
[null,100204,{"$f":"Calculation!B443","v":"LED Spot RGBW"},{"$f":"Products!B147","v":9},{"$f":"Calculation!D443","v":0.2},1.8]
[null,100203,{"$f":"Calculation!B444","v":"LED Spot WW"},{"$f":"Products!B148","v":24},{"$f":"Calculation!D444","v":0.2},4.8000000000000007]
[null,{"$f":"Products!C180","v":100235},{"$f":"Light!B23","v":"Příložný LED Spot RGBW bílá"},{"$f":"Products!B180","v":0},{"$f":"Calculation!D445","v":0.39200000000000002},0]
[null,{"$f":"Products!C181","v":100236},{"$f":"Light!B24","v":"Příložný LED Spot WW bílá"},{"$f":"Products!B181","v":0},{"$f":"Calculation!D446","v":0.39200000000000002},0]
[null,{"$f":"Products!C182","v":100237},{"$f":"Light!B25","v":"Příložný LED Spot Tree RGBW bílá"},{"$f":"Products!B182","v":0},{"$f":"Calculation!D447","v":0.39200000000000002},0]
[null,{"$f":"Products!C183","v":100238},{"$f":"Light!B26","v":"Příložný LED Spot Tree WW bílá"},{"$f":"Products!B183","v":0},{"$f":"Calculation!D448","v":0.39200000000000002},0]
[null,{"$f":"Products!C184","v":100268},{"$f":"Light!B27","v":"LED Spot Tree WW bílá"},{"$f":"Products!B184","v":0},{"$f":"Calculation!D449","v":0.23},0]
[null,{"$f":"Products!C185","v":100269},{"$f":"Light!B28","v":"LED Spot Tree RGBW bílá"},{"$f":"Products!B185","v":0},{"$f":"Calculation!D450","v":0.23},0]
[null,null,null,null,{"$f":"VLOOKUP(Main!C2,Translating_general!A29:P46,12,FALSE)","v":"Celkem"},{"$f":"SUM(F33:F48)","v":21}]
[]
[null,{"$f":"VLOOKUP(Main!C2,Translating_general!A29:P46,14,FALSE)","v":"Příslušenství"},null,null,null,null,null,null,null,null,null,null,null,null,null,null,null,null,null,null,null,null,null,{"$f":"VLOOKUP(Main!C2,Translating_general!A29:P46,14,FALSE)","v":"Příslušenství"}]
[null,{"$f":"VLOOKUP(Main!C2,Translating_general!A29:P46,5,FALSE)","v":"Číslo produktu"},{"$f":"VLOOKUP(Main!C2,Translating_general!A29:P46,6,FALSE)","v":"Produkty"},{"$f":"VLOOKUP(Main!C2,Translating_general!A29:P46,7,FALSE)","v":"Počet"},{"$f":"VLOOKUP(Main!C2,Translating_general!A29:P46,8,FALSE)","v":"Ampér/jednotku"},{"$f":"VLOOKUP(Main!C2,Translating_general!A29:P46,9,FALSE)","v":"Celkem"},null,null,null,null,null,null,null,null,null,null,null,null,null,null,null,null,null,{"$f":"VLOOKUP(Main!C2,Translating_general!A29:P46,10,FALSE)","v":"Zbývající Ampéry"},{"$f":"W55*1.3+W56*4.2+W57*10","v":1.3}]
[null,"200003",{"$f":"Calculation!B453","v":"Venkovní senzor teploty"},{"$f":"Products!B57","v":0},{"$f":"Calculation!D453","v":5.0000000000000001E-3},{"$f":"D53*E53","v":0},null,null,null,null,null,null,null,null,null,null,null,null,null,null,null,null,null,{"$f":"VLOOKUP(Main!C2,Translating_general!A29:P46,11,FALSE)","v":"Potřebné Ampéry"},{"$f":"F73","v":0.40279999999999999}]
[null,"200004",{"$f":"Calculation!B454","v":"No longer sold"},{"$f":"Products!B58","v":0},{"$f":"Calculation!D454","v":4.2000000000000003E-2},0]
[null,"200006",{"$f":"Calculation!B455","v":"Vnitřní teplotní senzor 0-10V"},{"$f":"Products!B60","v":0},{"$f":"Calculation!D455","v":5.0000000000000001E-3},0,null,null,null,null,null,null,null,null,null,null,null,null,null,null,null,"1,3A Netzteil",{"$f":"IF(F73>(W57*10+W56*4.2),ROUNDUP((F73-W57*10-W56*4.2)/1.3,0),0)","v":1}]
[null,"200010",{"$f":"Calculation!B456","v":"Senzor teploty a vlhkosti (vnitřní) 0-10V"},{"$f":"Products!B62","v":0},{"$f":"Calculation!D456","v":5.0000000000000001E-3},0,null,null,null,null,null,null,null,null,null,null,null,null,null,null,null,"4,2A Netzteil",{"$f":"IF((F73-W57*10)<1.3,0,IF((F73>W57*10),ROUNDUP((F73-W57*10)/4.2,0),0))","v":0}]
[null,"200017",{"$f":"Calculation!B457","v":"Senzor CO2/Teplota/Vlhkost"},{"$f":"Products!B65","v":0},{"$f":"Calculation!D457","v":0.01},0,null,null,null,null,null,null,null,null,null,null,null,null,null,null,null,"10A Netzteil",{"$f":"ROUNDDOWN(F73/10,0)","v":0}]
[null,"200018",{"$f":"Calculation!B458","v":"Dešťový senzor (24V)"},{"$f":"Products!B66","v":0},{"$f":"Calculation!D458","v":0.06},0]
[null,"200031",{"$f":"Calculation!B459","v":"Senzor teploty a vlhkosti (venkovní)"},{"$f":"Products!B67","v":0},{"$f":"Calculation!D459","v":5.0000000000000001E-3},0]
[null,"200032",{"$f":"Calculation!B460","v":"Senzor osvětlení 0-10V"},{"$f":"Products!B68","v":0},{"$f":"Calculation!D460","v":5.0000000000000001E-3},0]
[null,"200054",{"$f":"Calculation!B462","v":"Ultrazvukový senzor 0-10V"},{"$f":"Products!B79","v":0},{"$f":"Calculation!D462","v":0.06},0]
[null,"200112",{"$f":"Calculation!B463","v":"Senzor pohybu 24V (venkovní)"},{"$f":"Products!B105","v":2},{"$f":"Calculation!D463","v":1.4999999999999999E-2},0.03]
[null,200136,{"$f":"Calculation!B464","v":"Saunový senzor teplota/vlhkost"},{"$f":"Products!B109","v":0},{"$f":"Calculation!D464","v":5.0000000000000001E-3},0]
[null,"200154",{"$f":"Calculation!B465","v":"Senzor tlaku 0-10V"},{"$f":"Products!B115","v":0},{"$f":"Calculation!D465","v":0.01},0]
[null,100221,{"$f":"Calculation!B466","v":"Touch Tree bílá"},{"$f":"Products!B151","v":5},{"$f":"Products!O151","v":4.7999999999999996E-3},2.3999999999999997E-2]
[null,100222,{"$f":"Calculation!B467","v":"Touch Tree anthrazit"},{"$f":"Products!B152","v":0},{"$f":"Products!O152","v":4.7999999999999996E-3},0]
[null,100223,{"$f":"Calculation!B468","v":"Motion Sensor Tree bilá"},{"$f":"Products!B153","v":7},{"$f":"Products!O153","v":4.7999999999999996E-3},3.3599999999999998E-2]
[null,{"$f":"Products!C164","v":100219},{"$f":"Calculation!B471","v":"Touch pure Tree bílá"},{"$f":"Products!B164","v":4},4.7999999999999996E-3,1.9199999999999998E-2]
[null,{"$f":"Products!C154","v":100225},{"$f":"Products!D154","v":"Hlavice Tree"},{"$f":"Products!B154","v":6},0.05,{"$f":"Calculation!E472","v":0.25}]
[null,{"$f":"Products!C178","v":100220},{"$f":"Products!D178","v":"Touch pure for Tree Anthracite"},{"$f":"Products!B178","v":0},4.7999999999999996E-3,{"$f":"D70*E70","v":0}]
[null,{"$f":"Products!C189","v":100246},{"$f":"Products!D189","v":"Meteostanice Tree"},{"$f":"Products!B189","v":1},4.5999999999999999E-2,{"$f":"D71*E71","v":4.5999999999999999E-2}]
[null,null,"reserved"]
[null,null,null,null,{"$f":"VLOOKUP(Main!C2,Translating_general!A29:P46,12,FALSE)","v":"Celkem"},{"$f":"SUM(F53:F72)","v":0.40279999999999999}]
[]
[null,"Please note that the power calculation assumes you have everything centrally in one cabinet!"]
[null,"You have to double check it for your project."]

{"sheet":"Project information","index":16,"n_rows":194,"n_cols":51,"rows_kept":194,"cut":false,"hidden":true,"merged":[]}
[null,null,null,null,null,null,null,null,null,null,null,null,"Cathegory/Rooms",{"$f":"Main!D3","v":"Entrance room"},{"$f":"Main!E3","v":"Living Room"},{"$f":"Main!F3","v":"Kitchen"},{"$f":"Main!G3","v":"Bedroom"},{"$f":"Main!H3","v":"Hall"},{"$f":"Main!I3","v":"Bathroom"},{"$f":"Main!J3","v":"Technical room"},{"$f":"Main!K3","v":"Terrace"},{"$f":"Main!L3","v":"Entrance"},{"$f":"Main!M3","v":"Outside"},{"$f":"Main!N3","v":0},{"$f":"Main!O3","v":0},{"$f":"Main!P3","v":0},{"$f":"Main!Q3","v":0},{"$f":"Main!R3","v":0},{"$f":"Main!S3","v":0},{"$f":"Main!T3","v":0},{"$f":"Main!U3","v":0},{"$f":"Main!V3","v":0},{"$f":"Main!W3","v":0},{"$f":"Main!X3","v":0},{"$f":"Main!Y3","v":0},{"$f":"Main!Z3","v":0},{"$f":"Main!AA3","v":0},{"$f":"Main!AB3","v":0},{"$f":"Main!AC3","v":0},{"$f":"Main!AD3","v":0},{"$f":"Main!AE3","v":0},{"$f":"Main!AF3","v":0},{"$f":"Main!AG3","v":0},{"$f":"Main!AH3","v":0},{"$f":"Main!AI3","v":0},{"$f":"Main!AJ3","v":0},{"$f":"Main!AK3","v":0},{"$f":"Main!AL3","v":0},{"$f":"Main!AM3","v":0},{"$f":"Main!AN3","v":0},{"$f":"Main!AO3","v":0}]
[null,null,null,null,null,null,null,null,null,null,null,null,"Lighting"]
[null,null,null,null,null,null,null,null,null,null,null,null,"Heating"]
[null,null,null,null,null,null,null,null,null,null,null,null,"Shading"]
[null,null,null,null,null,null,null,null,null,null,null,null,"Music"]
[null,null,null,null,null,null,null,null,null,null,null,null,"Access"]
[]
[]
[]
[]
[]
[]
[]
[null,null,null,null,null,null,null,null,null,null,null,null,{"$f":"Products!D7","v":"Miniserver"}]
[null,null,null,null,null,null,null,null,null,null,null,null,{"$f":"Products!D8","v":"Extension"}]
[null,null,null,null,null,null,null,null,null,null,null,null,{"$f":"Products!D9","v":"Rollup český"}]
[null,null,null,null,null,null,null,null,null,null,null,null,{"$f":"Products!D10","v":"SD-Karta s firmwarem"}]
[null,null,null,null,null,null,null,null,null,null,null,null,{"$f":"Products!D11","v":"RS485 Extension"}]
[null,null,null,null,null,null,null,null,null,null,null,null,{"$f":"Products!D12","v":"DMX Extension"}]
[null,null,null,null,null,null,null,null,null,null,null,null,{"$f":"Products!D13","v":"RS 232 Extension"}]
[null,null,null,null,null,null,null,null,null,null,null,null,{"$f":"Products!D14","v":"1-Wire Extension"}]
[null,null,null,null,null,null,null,null,null,null,null,null,{"$f":"Products!D15","v":"Enocean Extension"}]
[null,null,null,null,null,null,null,null,null,null,null,null,{"$f":"Products!D16","v":"Neprodává se"}]
[null,null,null,null,null,null,null,null,null,null,null,null,{"$f":"Products!D17","v":"Weather Service 1 rok"}]
[null,null,null,null,null,null,null,null,null,null,null,null,{"$f":"Products!D18","v":"Weather Service 10 let"}]
[null,null,null,null,null,null,null,null,null,null,null,null,{"$f":"Products!D19","v":"Caller Service 1 rok"}]
[null,null,null,null,null,null,null,null,null,null,null,null,{"$f":"Products!D20","v":"Caller Service 10 let"}]
[null,null,null,null,null,null,null,null,null,null,null,null,{"$f":"Products!D21","v":"Dimmer Extension"}]
[null,null,null,null,null,null,null,null,null,null,null,null,{"$f":"Products!D22","v":"IR Set"}]
[null,null,null,null,null,null,null,null,null,null,null,null,{"$f":"Products!D23","v":"Relay Extension"}]
[null,null,null,null,null,null,null,null,null,null,null,null,{"$f":"Products!D24","v":"Air Base Extension"}]
[null,null,null,null,null,null,null,null,null,null,null,null,{"$f":"Products!D25","v":"Smart Socket Air Typ E"}]
[null,null,null,null,null,null,null,null,null,null,null,null,{"$f":"Products!D26","v":"Multi Extension Air"}]
[null,null,null,null,null,null,null,null,null,null,null,null,{"$f":"Products!D27","v":"RGBW 24V Dimmer DMX"}]
[null,null,null,null,null,null,null,null,null,null,null,null,{"$f":"Products!D28","v":"Modbus Extension"}]
[null,null,null,null,null,null,null,null,null,null,null,null,{"$f":"Products!D29","v":"RGBW 24V Dimmer Air"}]
[null,null,null,null,null,null,null,null,null,null,null,null,{"$f":"Products!D30","v":"Miniserver Go"}]
[null,null,null,null,null,null,null,null,null,null,null,null,{"$f":"Products!D31","v":"Remote Air"}]
[null,null,null,null,null,null,null,null,null,null,null,null,{"$f":"Products!D32","v":"IR Control Air"}]
[null,null,null,null,null,null,null,null,null,null,null,null,{"$f":"Products!D33","v":"Detektor kouře Air"}]
[null,null,null,null,null,null,null,null,null,null,null,null,{"$f":"Products!D34","v":"Senzor teploty & vlhkosti Air"}]
[null,null,null,null,null,null,null,null,null,null,null,null,{"$f":"Products!D35","v":"Loxone set nářadí"}]
[null,null,null,null,null,null,null,null,null,null,null,null,{"$f":"Products!D36","v":"IR Elektroměr Air"}]
[null,null,null,null,null,null,null,null,null,null,null,null,{"$f":"Products!D37","v":"Nano IO Air"}]
[null,null,null,null,null,null,null,null,null,null,null,null,{"$f":"Products!D38","v":"Loxone Touch for Nano Bílá"}]
[null,null,null,null,null,null,null,null,null,null,null,null,{"$f":"Products!D39","v":"Loxone Touch Air Bílá"}]
[null,null,null,null,null,null,null,null,null,null,null,null,{"$f":"Products!D40","v":"Fröling Extension"}]
[null,null,null,null,null,null,null,null,null,null,null,null,{"$f":"Products!D41","v":"Hlavice Air"}]
[null,null,null,null,null,null,null,null,null,null,null,null,{"$f":"Products!D42","v":"Loxone Music Server 4 Zóny"}]
[null,null,null,null,null,null,null,null,null,null,null,null,{"$f":"Products!D43","v":"Loxone Music Server 8 Zón"}]
[null,null,null,null,null,null,null,null,null,null,null,null,{"$f":"Products!D44","v":"Loxone Music Server 12 Zón"}]
[null,null,null,null,null,null,null,null,null,null,null,null,{"$f":"Products!D45","v":"Loxone Music Server 16 Zón"}]
[null,null,null,null,null,null,null,null,null,null,null,null,{"$f":"Products!D46","v":"Loxone Music Server 20 Zón"}]
[null,null,null,null,null,null,null,null,null,null,null,null,{"$f":"Products!D47","v":"not available in this country"}]
[null,null,null,null,null,null,null,null,null,null,null,null,{"$f":"Products!D48","v":"AquaStar Air 1.5\""}]
[null,null,null,null,null,null,null,null,null,null,null,null,{"$f":"Products!D49","v":"AquaStar Air 2\""}]
[null,null,null,null,null,null,null,null,null,null,null,null,{"$f":"Products!D50","v":"Loxone Touch Air Anthrazit"}]
[null,null,null,null,null,null,null,null,null,null,null,null,{"$f":"Products!D51","v":"Loxone Touch for Nano Anthrazit"}]
[null,null,null,null,null,null,null,null,null,null,null,null,{"$f":"Products!D52","v":"Trubkový Motor SOLIDline Air 10Nm"}]
[null,null,null,null,null,null,null,null,null,null,null,null,{"$f":"Products!D53","v":"Trubkový Motor SOLIDline Air 20Nm"}]
[null,null,null,null,null,null,null,null,null,null,null,null,{"$f":"Products!D54","v":"Trubkový Motor SOLIDline Air 50Nm"}]
[null,null,null,null,null,null,null,null,null,null,null,null,{"$f":"Products!D55","v":"24V Zdroj (1.3A)"}]
[null,null,null,null,null,null,null,null,null,null,null,null,{"$f":"Products!D56","v":"24V Zdroj (4.2A)"}]
[null,null,null,null,null,null,null,null,null,null,null,null,{"$f":"Products!D57","v":"Venkovní senzor teploty"}]
[null,null,null,null,null,null,null,null,null,null,null,null,{"$f":"Products!D58","v":"No longer sold"}]
[null,null,null,null,null,null,null,null,null,null,null,null,{"$f":"Products!D59","v":"No longer sold"}]
[null,null,null,null,null,null,null,null,null,null,null,null,{"$f":"Products!D60","v":"Vnitřní teplotní senzor 0-10V"}]
[null,null,null,null,null,null,null,null,null,null,null,null,{"$f":"Products!D61","v":"not available in this country"}]
[null,null,null,null,null,null,null,null,null,null,null,null,{"$f":"Products!D62","v":"Senzor teploty a vlhkosti (vnitřní) 0-10V"}]
[null,null,null,null,null,null,null,null,null,null,null,null,{"$f":"Products!D63","v":"Adaptér ventilu VA80"}]
[null,null,null,null,null,null,null,null,null,null,null,null,{"$f":"Products!D64","v":"not available in this country"}]
[null,null,null,null,null,null,null,null,null,null,null,null,{"$f":"Products!D65","v":"Senzor CO2/Teplota/Vlhkost"}]
[null,null,null,null,null,null,null,null,null,null,null,null,{"$f":"Products!D66","v":"Dešťový senzor (24V)"}]
[null,null,null,null,null,null,null,null,null,null,null,null,{"$f":"Products!D67","v":"Senzor teploty a vlhkosti (venkovní)"}]
[null,null,null,null,null,null,null,null,null,null,null,null,{"$f":"Products!D68","v":"Senzor osvětlení 0-10V"}]
[null,null,null,null,null,null,null,null,null,null,null,null,{"$f":"Products!D69","v":"Senzor větru (24V)"}]
[null,null,null,null,null,null,null,null,null,null,null,null,{"$f":"Products!D70","v":"Držák pro senzor větru"}]
[null,null,null,null,null,null,null,null,null,null,null,null,{"$f":"Products!D71","v":"24V Zdroj (10A)"}]
[null,null,null,null,null,null,null,null,null,null,null,null,{"$f":"Products!D72","v":"Instalační krabice IP20 bílá"}]
[null,null,null,null,null,null,null,null,null,null,null,null,{"$f":"Products!D73","v":"5m RGB LED pásky IP20 (bez ochrany proti vodě)"}]
[null,null,null,null,null,null,null,null,null,null,null,null,{"$f":"Products!D74","v":"5m LED pásky (teplá bílá) - IP20 (bez ochrany proti vodě)"}]
[null,null,null,null,null,null,null,null,null,null,null,null,{"$f":"Products!D75","v":"5m RGB LED pásky IP68 (proti potopení do vody)"}]
[null,null,null,null,null,null,null,null,null,null,null,null,{"$f":"Products!D76","v":"SMA anténa 868 MHz"}]
[null,null,null,null,null,null,null,null,null,null,null,null,{"$f":"Products!D77","v":"Spojovací relé"}]
[null,null,null,null,null,null,null,null,null,null,null,null,{"$f":"Products!D78","v":"Loxone samolepky"}]
[null,null,null,null,null,null,null,null,null,null,null,null,{"$f":"Products!D79","v":"Ultrazvukový senzor 0-10V"}]
[null,null,null,null,null,null,null,null,null,null,null,null,{"$f":"Products!D80","v":"Enocean Bezdrátové tlačítko"}]
[null,null,null,null,null,null,null,null,null,null,null,null,{"$f":"Products!D81","v":"Enocean Bezdrátový okenní kontakt"}]
[null,null,null,null,null,null,null,null,null,null,null,null,{"$f":"Products!D82","v":"5m LED pásky (teplá bílá) - IP65 (proti tryskající vodě)"}]
[null,null,null,null,null,null,null,null,null,null,null,null,{"$f":"Products!D83","v":"Čtečka elektronického klíče"}]
[null,null,null,null,null,null,null,null,null,null,null,null,{"$f":"Products!D84","v":"Elektronický klíč"}]
[null,null,null,null,null,null,null,null,null,null,null,null,{"$f":"Products!D85","v":"EnOcean bezdrátová hlavice"}]
[null,null,null,null,null,null,null,null,null,null,null,null,{"$f":"Products!D86","v":"Elektronický klíč (Magnetický)"}]
[null,null,null,null,null,null,null,null,null,null,null,null,{"$f":"Products!D87","v":"1-Wire teplotní čip v pouzdře"}]
[null,null,null,null,null,null,null,null,null,null,null,null,{"$f":"Products!D88","v":"Loxone Fanshirt S"}]
[null,null,null,null,null,null,null,null,null,null,null,null,{"$f":"Products!D89","v":"Loxone Fanshirt M"}]
[null,null,null,null,null,null,null,null,null,null,null,null,{"$f":"Products!D90","v":"Loxone Fanshirt L"}]
[null,null,null,null,null,null,null,null,null,null,null,null,{"$f":"Products!D91","v":"Loxone Fanshirt XL"}]
[null,null,null,null,null,null,null,null,null,null,null,null,{"$f":"Products!D92","v":"Loxone Fanshirt XXL"}]
[null,null,null,null,null,null,null,null,null,null,null,null,{"$f":"Products!D93","v":"5m LED pásky (teplá bílá) - IP68 (proti potopení do vody)"}]
[null,null,null,null,null,null,null,null,null,null,null,null,{"$f":"Products!D94","v":"Loxone Intercom"}]
[null,null,null,null,null,null,null,null,null,null,null,null,{"$f":"Products!D95","v":"Zapuštěný box pro Loxone Intercom"}]
[null,null,null,null,null,null,null,null,null,null,null,null,{"$f":"Products!D96","v":"Povrchový box pro Loxone Intercom"}]
[null,null,null,null,null,null,null,null,null,null,null,null,{"$f":"Products!D97","v":"Loxone Speaker"}]
[null,null,null,null,null,null,null,null,null,null,null,null,{"$f":"Products!D98","v":"5m RGBW LED pásky IP20 (bez ochrany proti vodě)"}]
[null,null,null,null,null,null,null,null,null,null,null,null,{"$f":"Products!D99","v":"5m RGBW LED pásky IP65 (proti tryskající vodě)"}]
[null,null,null,null,null,null,null,null,null,null,null,null,{"$f":"Products!D100","v":"5m RGBW LED pásky IP68 (proti potopení do vody)"}]
[null,null,null,null,null,null,null,null,null,null,null,null,{"$f":"Products!D101","v":"Záplavový senzor"}]
[null,null,null,null,null,null,null,null,null,null,null,null,{"$f":"Products!D102","v":"not available in this country"}]
[null,null,null,null,null,null,null,null,null,null,null,null,{"$f":"Products!D103","v":"1-Wire teplotní senzor set"}]
[null,null,null,null,null,null,null,null,null,null,null,null,{"$f":"Products!D104","v":"Loxone 12ti kanálový zesilovač"}]
[null,null,null,null,null,null,null,null,null,null,null,null,{"$f":"Products!D105","v":"Senzor pohybu 24V (venkovní)"}]
[null,null,null,null,null,null,null,null,null,null,null,null,{"$f":"Products!D106","v":"Okenní kontakt"}]
[null,null,null,null,null,null,null,null,null,null,null,null,{"$f":"Products!D107","v":"Loxone Cat 7 kabel"}]
[null,null,null,null,null,null,null,null,null,null,null,null,{"$f":"Products!D108","v":"Enocean Bezdrátový pohybový senzor"}]
[null,null,null,null,null,null,null,null,null,null,null,null,{"$f":"Products!D109","v":"Saunový senzor teplota/vlhkost"}]
[null,null,null,null,null,null,null,null,null,null,null,null,{"$f":"Products!D110","v":"EnOcean bezdrátový aktor"}]
[null,null,null,null,null,null,null,null,null,null,null,null,{"$f":"Products!D111","v":"Zdroj 24V, 0,4A"}]
[null,null,null,null,null,null,null,null,null,null,null,null,{"$f":"Products!D112","v":"Instalační box pro Loxone reproduktor (speaker)"}]
[null,null,null,null,null,null,null,null,null,null,null,null,{"$f":"Products!D113","v":"SMA Anténa 4dBi 868 MHz"}]
[null,null,null,null,null,null,null,null,null,null,null,null,{"$f":"Products!D114","v":"Loxone Wall Speaker"}]
[null,null,null,null,null,null,null,null,null,null,null,null,{"$f":"Products!D115","v":"Senzor tlaku 0-10V"}]
[null,null,null,null,null,null,null,null,null,null,null,null,{"$f":"Products!D116","v":"Senzor rozbití okna 24V"}]
[null,null,null,null,null,null,null,null,null,null,null,null,{"$f":"Products!D117","v":"1-fázový elektroměr (Modbus)"}]
[null,null,null,null,null,null,null,null,null,null,null,null,{"$f":"Products!D118","v":"3-fázový elektroměr (Modbus)"}]
[null,null,null,null,null,null,null,null,null,null,null,null,{"$f":"Products!D119","v":"not available in this country"}]
[null,null,null,null,null,null,null,null,null,null,null,null,{"$f":"Products!D120","v":"Svorka na DIN lištu PPV8 (20 kusů)"}]
[null,null,null,null,null,null,null,null,null,null,null,null,{"$f":"Products!D121","v":"Propojovací rozvaděč PRV8 (20 kusů)"}]
[null,null,null,null,null,null,null,null,null,null,null,null,{"$f":"Products!D122","v":"Předělovací deska PRV8 (10 kusů)"}]
[null,null,null,null,null,null,null,null,null,null,null,null,{"$f":"Products!D123","v":"Držák na značky pro PPV8/PRV8 (20 kusů)"}]
[null,null,null,null,null,null,null,null,null,null,null,null,{"$f":"Products!D124","v":"Bočnice pro PPV8/PRV8 (10 kusů)"}]
[null,null,null,null,null,null,null,null,null,null,null,null,{"$f":"Products!D125","v":"Svorka pro připojení motoru PMAK4 (50 kusů)"}]
[null,null,null,null,null,null,null,null,null,null,null,null,{"$f":"Products!D126","v":"Bočnice pro PMAK4 (20 kusů)"}]
[null,null,null,null,null,null,null,null,null,null,null,null,{"$f":"Products!D127","v":"Svorkovnice PDL (50 kusů)"}]
[null,null,null,null,null,null,null,null,null,null,null,null,{"$f":"Products!D128","v":"Bočnice pro PDL (20 kusů)"}]
[null,null,null,null,null,null,null,null,null,null,null,null,{"$f":"Products!D129","v":"Koncová podpěra svorkovnice ZEW 35 (20 kusů)"}]
[null,null,null,null,null,null,null,null,null,null,null,null,{"$f":"Products!D130","v":"Pojistková svorkovnice (25 kusů)"}]
[null,null,null,null,null,null,null,null,null,null,null,null,{"$f":"Products!D131","v":"Bočnice pojistkové svorkovnice (50 kusů)"}]
[null,null,null,null,null,null,null,null,null,null,null,null,{"$f":"Products!D132","v":"24 pólová propojka (10 kusů)"}]
[null,null,null,null,null,null,null,null,null,null,null,null,{"$f":"Products!D133","v":"Pojistky 2A (100 kusů)"}]
[null,null,null,null,null,null,null,null,null,null,null,null,{"$f":"Products!D134","v":"Pojistky 5A (100 kusů)"}]
[null,null,null,null,null,null,null,null,null,null,null,null,{"$f":"Products!D135","v":"Pojistky 10A (100 kusů)"}]
[null,null,null,null,null,null,null,null,null,null,null,null,{"$f":"Products!D136","v":"Loxone brožurka - 25 kusů"}]
[null,null,null,null,null,null,null,null,null,null,null,null,{"$f":"Products!D137","v":"čtečka elektronického klíče - nerez"}]
[null,null,null,null,null,null,null,null,null,null,null,null,{"$f":"Products!D138","v":"Keba KeContact P20 Wallbox"}]
[null,null,null,null,null,null,null,null,null,null,null,null,{"$f":"Products!D139","v":"Loxone Speaker back box pro snížené stropy"}]
[null,null,null,null,null,null,null,null,null,null,null,null,{"$f":"Products!D140","v":"Příslušenství k LED páskům - set RGBW"}]
[null,null,null,null,null,null,null,null,null,null,null,null,{"$f":"Products!D141","v":"Příslušenství k LED páskům - set WW"}]
[null,null,null,null,null,null,null,null,null,null,null,null,{"$f":"Products!D142","v":"Napájecí zdroj do zásuvky 24V, 6,25A Typ E,F"}]
[null,null,null,null,null,null,null,null,null,null,null,null,{"$f":"Products!D143","v":"Loxone Music Server Upgrade"}]
[null,null,null,null,null,null,null,null,null,null,null,null,{"$f":"Products!D144","v":"Loxone Intercom XL"}]
[null,null,null,null,null,null,null,null,null,null,null,null,{"$f":"Products!D145","v":"Pohybový senzor Air"}]
[null,null,null,null,null,null,null,null,null,null,null,null,{"$f":"Products!D146","v":"NFC Smart tagy"}]
[null,null,null,null,null,null,null,null,null,null,null,null,{"$f":"Products!D147","v":"LED Spot RGBW"}]
[null,null,null,null,null,null,null,null,null,null,null,null,{"$f":"Products!D148","v":"LED Spot WW"}]
[null,null,null,null,null,null,null,null,null,null,null,null,{"$f":"Products!D149","v":"Nabíjecí kabel typ 2"}]
[null,null,null,null,null,null,null,null,null,null,null,null,{"$f":"Products!D150","v":"Tree Extension"}]
[null,null,null,null,null,null,null,null,null,null,null,null,{"$f":"Products!D151","v":"Touch Tree bílá"}]
[null,null,null,null,null,null,null,null,null,null,null,null,{"$f":"Products!D152","v":"Touch Tree anthrazit"}]
[null,null,null,null,null,null,null,null,null,null,null,null,{"$f":"Products!D153","v":"Motion Sensor Tree bilá"}]
[null,null,null,null,null,null,null,null,null,null,null,null,{"$f":"Products!D154","v":"Hlavice Tree"}]
[null,null,null,null,null,null,null,null,null,null,null,null,{"$f":"Products!D155","v":"Záplavový senzor Air"}]
[null,null,null,null,null,null,null,null,null,null,null,null,{"$f":"Products!D156","v":"Okenní a dveřní kontakt Air anthrazit"}]
[null,null,null,null,null,null,null,null,null,null,null,null,{"$f":"Products!D157","v":"Okenní a dveřní kontakt Air bílá"}]
[null,null,null,null,null,null,null,null,null,null,null,null,{"$f":"Products!D158","v":"Pohybový senzor Tree anthrazit"}]
[null,null,null,null,null,null,null,null,null,null,null,null,{"$f":"Products!D159","v":"20-ti pólová propojka Weidmuller (20 ks)"}]
[null,null,null,null,null,null,null,null,null,null,null,null,{"$f":"Products!D160","v":"Dali Extension"}]
[null,null,null,null,null,null,null,null,null,null,null,null,{"$f":"Products!D161","v":"Spínaný LED zdroj 24V 2,5A"}]
[null,null,null,null,null,null,null,null,null,null,null,null,{"$f":"Products!D162","v":"Touch pure Air bílá"}]
[null,null,null,null,null,null,null,null,null,null,null,null,{"$f":"Products!D163","v":"Touch pure for Nano bílá"}]
[null,null,null,null,null,null,null,null,null,null,null,null,{"$f":"Products!D164","v":"Touch pure Tree bílá"}]
[null,null,null,null,null,null,null,null,null,null,null,null,{"$f":"Products!D165","v":"Internorm Extension"}]
[null,null,null,null,null,null,null,null,null,null,null,null,{"$f":"Products!D166","v":"Nano Dimmer Air"}]
[null,null,null,null,null,null,null,null,null,null,null,null,{"$f":"Products!D167","v":"Dvoužilový kroucený kabel modrá/bílá"}]
[null,null,null,null,null,null,null,null,null,null,null,null,{"$f":"Products!D168","v":"Dvoužilový kroucený kabel oranžová/bílá"}]
[null,null,null,null,null,null,null,null,null,null,null,null,{"$f":"Products!D169","v":"Dvoužilový kroucený kabel zelená/bílá"}]
[null,null,null,null,null,null,null,null,null,null,null,null,{"$f":"Products!D170","v":"Duracell Plus Power AA (12 ks)"}]
[null,null,null,null,null,null,null,null,null,null,null,null,{"$f":"Products!D171","v":"Duracell Plus Power AAA (12 ks)"}]
[null,null,null,null,null,null,null,null,null,null,null,null,{"$f":"Products!D172","v":"CR2032 Lithium Battery (20 ks)"}]
[null,null,null,null,null,null,null,null,null,null,null,null,{"$f":"Products!D173","v":"CR2450 Lithium Battery (20 ks)"}]
[null,null,null,null,null,null,null,null,null,null,null,null,{"$f":"Products!D174","v":"FDK 9V Lithium Battery"}]
[null,null,null,null,null,null,null,null,null,null,null,null,{"$f":"Products!D175","v":"Nano DI Tree"}]
[null,null,null,null,null,null,null,null,null,null,null,null,{"$f":"Products!D176","v":"not available in this country"}]
[null,null,null,null,null,null,null,null,null,null,null,null,{"$f":"Products!D177","v":"Touch pure for Nano Anthracite"}]
[null,null,null,null,null,null,null,null,null,null,null,null,{"$f":"Products!D178","v":"Touch pure for Tree Anthracite"}]
[null,null,null,null,null,null,null,null,null,null,null,null,{"$f":"Products!D179","v":"Touch pure Air Anthracite"}]
[null,null,null,null,null,null,null,null,null,null,null,null,{"$f":"Products!D180","v":"Příložný LED Spot RGBW bílá"}]
[null,null,null,null,null,null,null,null,null,null,null,null,{"$f":"Products!D181","v":"Příložný LED Spot WW bílá"}]
[null,null,null,null,null,null,null,null,null,null,null,null,{"$f":"Products!D182","v":"Příložný LED Spot Tree RGBW bílá"}]
[null,null,null,null,null,null,null,null,null,null,null,null,{"$f":"Products!D183","v":"Příložný LED Spot Tree WW bílá"}]
[null,null,null,null,null,null,null,null,null,null,null,null,{"$f":"Products!D184","v":"LED Spot Tree WW bílá"}]
[null,null,null,null,null,null,null,null,null,null,null,null,{"$f":"Products!D185","v":"LED Spot Tree RGBW bílá"}]
[null,null,null,null,null,null,null,null,null,null,null,null,{"$f":"Products!D186","v":"RGBW 24V Dimmer Tree"}]
[null,null,null,null,null,null,null,null,null,null,null,null,{"$f":"Products!D187","v":"Okenní klika Air"}]

{"sheet":"Space","index":17,"n_rows":36,"n_cols":9,"rows_kept":36,"cut":false,"hidden":false,"merged":[[7,7,7,8],[2,1,3,5]]}
[]
[]
[null,{"$f":"VLOOKUP(Main!C2,Translating_general!A53:P70,2,FALSE)","v":"Výpočet požadovaného místa v rozvaděči"}]
[]
[]
[null,{"$f":"VLOOKUP(Main!C2,Translating_general!A53:P70,3,FALSE)","v":"Číslo produktu"},{"$f":"VLOOKUP(Main!C2,Translating_general!A53:P70,4,FALSE)","v":"Produkty"},{"$f":"VLOOKUP(Main!C2,Translating_general!A53:P70,5,FALSE)","v":"Počet"},{"$f":"VLOOKUP(Main!C2,Translating_general!A53:P70,6,FALSE)","v":"Požadované místo"},{"$f":"VLOOKUP(Main!C2,Translating_general!A53:P70,7,FALSE)","v":"Celkem"}]
[null,"100001",{"$f":"Calculation!B481","v":"Miniserver"},{"$f":"Products!B7","v":1},{"$f":"Calculation!D481","v":155},{"$f":"D7*E7","v":155}]
[null,"100002",{"$f":"Calculation!B482","v":"Extension"},{"$f":"Products!B8","v":0},{"$f":"Calculation!D482","v":155},{"$f":"D8*E8","v":0},null,{"$f":"VLOOKUP(Main!C2,Translating_general!A53:P70,8,FALSE)","v":"Celkem místa"}]
[null,"100011",{"$f":"Calculation!B483","v":"RS485 Extension"},{"$f":"Products!B11","v":0},{"$f":"Calculation!D483","v":34},0,null,{"$f":"VLOOKUP(Main!C2,Translating_general!A53:P70,9,FALSE)","v":"Požadované místo v mm"},{"$f":"SUM(F7:F36)","v":1201}]
[null,"100012",{"$f":"Calculation!B484","v":"DMX Extension"},{"$f":"Products!B12","v":0},{"$f":"Calculation!D484","v":34},0,null,{"$f":"VLOOKUP(Main!C2,Translating_general!A53:P70,10,FALSE)","v":"Počet modulů v rozvaděči"},{"$f":"ROUNDUP(I9/17.2,0)","v":70}]
[null,"100013",{"$f":"Calculation!B485","v":"RS 232 Extension"},{"$f":"Products!B13","v":0},{"$f":"Calculation!D485","v":34},0]
[null,"100014",{"$f":"Calculation!B486","v":"1-Wire Extension"},{"$f":"Products!B14","v":0},{"$f":"Calculation!D486","v":34},0]
[null,"100015",{"$f":"Calculation!B487","v":"Enocean Extension"},{"$f":"Products!B15","v":0},{"$f":"Calculation!D487","v":34},0]
[null,"100029",{"$f":"Calculation!B488","v":"Dimmer Extension"},{"$f":"Products!B21","v":0},{"$f":"Calculation!D488","v":155},0]
[null,"100035",{"$f":"Calculation!B489","v":"IR Set"},{"$f":"Products!B22","v":0},{"$f":"Calculation!D489","v":34},0]
[null,"100038",{"$f":"Calculation!B490","v":"Relay Extension"},{"$f":"Products!B23","v":2},{"$f":"Calculation!D490","v":155},310]
[null,"100114",{"$f":"Calculation!B491","v":"Air Base Extension"},{"$f":"Products!B24","v":1},{"$f":"Calculation!D491","v":34},34]
[null,"100124",{"$f":"Calculation!B492","v":"Modbus Extension"},{"$f":"Products!B28","v":0},{"$f":"Calculation!D492","v":34},0]
[null,"100158",{"$f":"Calculation!B493","v":"Fröling Extension"},{"$f":"Products!B40","v":0},{"$f":"Calculation!D493","v":35},0]
[null,"200049",{"$f":"Calculation!B494","v":"Spojovací relé"},{"$f":"Products!B77","v":0},{"$f":"Calculation!D494","v":17},0]
[null,"100117",{"$f":"Calculation!B495","v":"RGBW 24V Dimmer DMX"},{"$f":"Products!B27","v":0},{"$f":"Calculation!D495","v":34},0]
[null,"200001",{"$f":"Calculation!B496","v":"24V Zdroj (1.3A)"},{"$f":"Products!B55","v":2},{"$f":"Calculation!D496","v":53},106]
[null,"200002",{"$f":"Calculation!B497","v":"24V Zdroj (4.2A)"},{"$f":"Products!B56","v":1},{"$f":"Calculation!D497","v":90},90]
[null,"200035",{"$f":"Calculation!B498","v":"24V Zdroj (10A)"},{"$f":"Products!B71","v":2},{"$f":"Calculation!D498","v":83},166]
[null,"200143",{"$f":"Calculation!B499","v":"Zdroj 24V, 0,4A"},{"$f":"Products!B111","v":0},{"$f":"Calculation!D499","v":18},0]
[null,"200156",{"$f":"Calculation!B500","v":"1-fázový elektroměr (Modbus)"},{"$f":"Products!B117","v":0},{"$f":"Calculation!D500","v":17.5},0]
[null,"200157",{"$f":"Calculation!B501","v":"3-fázový elektroměr (Modbus)"},{"$f":"Products!B118","v":0},{"$f":"Calculation!D501","v":70},0]
[null,"200168",{"$f":"Calculation!B502","v":"Svorka na DIN lištu PPV8 (20 kusů)"},{"$f":"Products!B120","v":0},{"$f":"Calculation!D502","v":120},0]
[null,"200169",{"$f":"Calculation!B503","v":"Propojovací rozvaděč PRV8 (20 kusů)"},{"$f":"Products!B121","v":0},{"$f":"Calculation!D503","v":120},0]
[null,"200173",{"$f":"Calculation!B504","v":"Svorka pro připojení motoru PMAK4 (50 kusů)"},{"$f":"Products!B125","v":0},{"$f":"Calculation!D504","v":104},0]
[null,"200175",{"$f":"Calculation!B505","v":"Svorkovnice PDL (50 kusů)"},{"$f":"Products!B127","v":0},{"$f":"Calculation!D505","v":100},0]
[null,"200178",{"$f":"Calculation!B506","v":"Pojistková svorkovnice (25 kusů)"},{"$f":"Products!B130","v":0},{"$f":"Calculation!D506","v":70},0]
[null,{"$f":"Products!C160","v":100200},{"$f":"Calculation!B508","v":"Dali Extension"},{"$f":"Products!B160","v":0},{"$f":"Calculation!D508","v":34},0]
[null,{"$f":"Products!C150","v":100218},{"$f":"Calculation!B507","v":"Tree Extension"},{"$f":"Products!B150","v":1},{"$f":"Calculation!D507","v":34},34]
[null,{"$f":"Products!C186","v":100239},{"$f":"Calculation!B509","v":"RGBW 24V Dimmer Tree"},{"$f":"Products!B186","v":9},{"$f":"Calculation!D509","v":34},306]
[null,{"$f":"Products!C188","v":100283},{"$f":"Products!D188","v":"DI Extension"},{"$f":"Products!B188","v":0},34,0]

{"sheet":"Products","index":18,"n_rows":228,"n_cols":18,"rows_kept":228,"cut":false,"hidden":false,"merged":[[221,3,221,5],[217,3,217,4],[2,1,3,6],[197,4,197,5],[198,4,198,5]]}
[]
[]
[null,{"$f":"VLOOKUP(Main!C2,Translating_general!A77:AF94,2,FALSE)","v":"Seznam produktů"}]
[]
[]
[null,{"$f":"VLOOKUP(Main!C2,Translating_general!A77:AF94,3,FALSE)","v":"Počet"},{"$f":"VLOOKUP(Main!C2,Translating_general!A77:AF94,4,FALSE)","v":"č."},{"$f":"VLOOKUP(Main!C2,Translating_general!A77:AF94,5,FALSE)","v":"Popis"},{"$f":"VLOOKUP(Main!C2,Translating_general!A77:AF94,6,FALSE)","v":"Cena za kus bez DPH"},{"$f":"VLOOKUP(Main!C2,Translating_general!A77:AF94,7,FALSE)","v":"Cena za kus s DPH"},{"$f":"VLOOKUP(Main!C2,Translating_general!A77:AF94,8,FALSE)","v":"Celkem"},null,"Kategorie","AI (Eingang)","DI (Eingang)","AO (Ausgang)","DO (Ausgang)","Kanäle","Ampere gesamt pro Produkt","Watt gesamt pro Produkt"]
[null,{"$f":"Calculation!C5+Calculation!C47+Calculation!C395","v":1},{"$f":"HLOOKUP(Main!$C$2,Translating_products!$CN$4:$DD$216,Translating_products!CM5, FALSE)","v":100001},{"$f":"HLOOKUP(Main!$C$2,Translating_products!$DI$4:$DY$216,Translating_products!CM5, FALSE)","v":"Miniserver"},{"$f":"IF(ISBLANK($Q$1),HLOOKUP(Main!$C$2,Translating_products!$EE$4:$EU$216,Translating_products!CM5,FALSE),HLOOKUP($Q$1,Translating_products!$EE$4:$EU$216,Translating_products!CM5,FALSE))","v":10329.75},{"$f":"E7*(1+$E$197*0.01)","v":12498.997499999999},{"$f":"B7*F7","v":12498.997499999999},{"$f":"SUM(G7:G137)","v":167145.14079999999},"Extension",4,8,4,8,null,{"$f":"0.12*B7","v":0.12},null,{"$f":"IF(ISBLANK($Q$1),VLOOKUP(Main!C2,Translating_general!A77:AG94,33,FALSE),VLOOKUP($Q$1,Translating_general!A77:AG94,33,FALSE))","v":"Kč"},"R"]
[null,{"$f":"Calculation!C396+Calculation!C28+Calculation!C35","v":0},{"$f":"HLOOKUP(Main!$C$2,Translating_products!$CN$4:$DD$216,Translating_products!CM6, FALSE)","v":100002},{"$f":"HLOOKUP(Main!$C$2,Translating_products!$DI$4:$DY$216,Translating_products!CM6, FALSE)","v":"Extension"},{"$f":"IF(ISBLANK($Q$1),HLOOKUP(Main!$C$2,Translating_products!$EE$4:$EU$216,Translating_products!CM6,FALSE),HLOOKUP($Q$1,Translating_products!$EE$4:$EU$216,Translating_products!CM6,FALSE))","v":8263.64},9999.0043999999998,{"$f":"B8*F8","v":0},{"$f":"IF(B7:B137>0,1,0)","v":0},"Extension",4,12,4,8,null,{"$f":"B8*0.06","v":0},null,{"$f":"$Q$7","v":"Kč"},"R"]
[null,{"$f":"Calculation!C335","v":0},{"$f":"HLOOKUP(Main!$C$2,Translating_products!$CN$4:$DD$216,Translating_products!CM7, FALSE)","v":100040},{"$f":"HLOOKUP(Main!$C$2,Translating_products!$DI$4:$DY$216,Translating_products!CM7, FALSE)","v":"Rollup český"},{"$f":"IF(ISBLANK($Q$1),HLOOKUP(Main!$C$2,Translating_products!$EE$4:$EU$216,Translating_products!CM7,FALSE),HLOOKUP($Q$1,Translating_products!$EE$4:$EU$216,Translating_products!CM7,FALSE))","v":2699},3265.79,0,null,"Sonstiges",null,null,null,null,null,"nix",null,{"$f":"$Q$7","v":"Kč"},"R"]
[null,{"$f":"Calculation!C290","v":0},{"$f":"HLOOKUP(Main!$C$2,Translating_products!$CN$4:$DD$216,Translating_products!CM8, FALSE)","v":100008},{"$f":"HLOOKUP(Main!$C$2,Translating_products!$DI$4:$DY$216,Translating_products!CM8, FALSE)","v":"SD-Karta s firmwarem"},{"$f":"IF(ISBLANK($Q$1),HLOOKUP(Main!$C$2,Translating_products!$EE$4:$EU$216,Translating_products!CM8,FALSE),HLOOKUP($Q$1,Translating_products!$EE$4:$EU$216,Translating_products!CM8,FALSE))","v":247.11},299.00310000000002,0,null,"Sonstiges",null,null,null,null,null,"nix",null,"Kč","R"]
[null,{"$f":"Calculation!C291+Calculation!C397","v":0},{"$f":"HLOOKUP(Main!$C$2,Translating_products!$CN$4:$DD$216,Translating_products!CM9, FALSE)","v":100011},{"$f":"HLOOKUP(Main!$C$2,Translating_products!$DI$4:$DY$216,Translating_products!CM9, FALSE)","v":"RS485 Extension"},{"$f":"IF(ISBLANK($Q$1),HLOOKUP(Main!$C$2,Translating_products!$EE$4:$EU$216,Translating_products!CM9,FALSE),HLOOKUP($Q$1,Translating_products!$EE$4:$EU$216,Translating_products!CM9,FALSE))","v":3511.57},4248.9997000000003,0,"Sonstiges wird einfach ausgewählt","Sonstiges/Extension",null,null,null,null,null,{"$f":"B11*0.03","v":0},null,"Kč","R"]
[null,{"$f":"Calculation!C78+Calculation!C398+Calculation!E528","v":0},{"$f":"HLOOKUP(Main!$C$2,Translating_products!$CN$4:$DD$216,Translating_products!CM10, FALSE)","v":100012},{"$f":"HLOOKUP(Main!$C$2,Translating_products!$DI$4:$DY$216,Translating_products!CM10, FALSE)","v":"DMX Extension"},{"$f":"IF(ISBLANK($Q$1),HLOOKUP(Main!$C$2,Translating_products!$EE$4:$EU$216,Translating_products!CM10,FALSE),HLOOKUP($Q$1,Translating_products!$EE$4:$EU$216,Translating_products!CM10,FALSE))","v":5619.01},6799.0020999999997,0,null,"Licht/Extension",null,null,null,null,128,0.03,null,"Kč","L"]
[null,{"$f":"Calculation!C292+Calculation!C399","v":0},{"$f":"HLOOKUP(Main!$C$2,Translating_products!$CN$4:$DD$216,Translating_products!CM11, FALSE)","v":100013},{"$f":"HLOOKUP(Main!$C$2,Translating_products!$DI$4:$DY$216,Translating_products!CM11, FALSE)","v":"RS 232 Extension"},{"$f":"IF(ISBLANK($Q$1),HLOOKUP(Main!$C$2,Translating_products!$EE$4:$EU$216,Translating_products!CM11,FALSE),HLOOKUP($Q$1,Translating_products!$EE$4:$EU$216,Translating_products!CM11,FALSE))","v":3511.57},4248.9997000000003,0,"Sonstiges wird einfach ausgewählt","Sonstiges/Extension",null,null,null,null,null,{"$f":"0.03*B13","v":0},null,"Kč","R"]
[null,{"$f":"Calculation!C12+Calculation!C40+Calculation!C400+Calculation!G160","v":0},{"$f":"HLOOKUP(Main!$C$2,Translating_products!$CN$4:$DD$216,Translating_products!CM12, FALSE)","v":100014},{"$f":"HLOOKUP(Main!$C$2,Translating_products!$DI$4:$DY$216,Translating_products!CM12, FALSE)","v":"1-Wire Extension"},{"$f":"IF(ISBLANK($Q$1),HLOOKUP(Main!$C$2,Translating_products!$EE$4:$EU$216,Translating_products!CM12,FALSE),HLOOKUP($Q$1,Translating_products!$EE$4:$EU$216,Translating_products!CM12,FALSE))","v":3511.57},4248.9997000000003,0,"Temparaturfühler & iButton; 20 Fühler möglich, Lesegerät für Zutritt 1x Fühler benötigt","Extension",null,null,null,null,20,{"$f":"0.03*B14","v":0},null,"Kč","R"]
[null,{"$f":"Calculation!C42+Calculation!C293+Calculation!C401","v":0},{"$f":"HLOOKUP(Main!$C$2,Translating_products!$CN$4:$DD$216,Translating_products!CM13, FALSE)","v":100015},{"$f":"HLOOKUP(Main!$C$2,Translating_products!$DI$4:$DY$216,Translating_products!CM13, FALSE)","v":"Enocean Extension"},{"$f":"IF(ISBLANK($Q$1),HLOOKUP(Main!$C$2,Translating_products!$EE$4:$EU$216,Translating_products!CM13,FALSE),HLOOKUP($Q$1,Translating_products!$EE$4:$EU$216,Translating_products!CM13,FALSE))","v":6197.52},7498.9992000000002,0,"Sonstiges wird einfach ausgewählt","Sonstiges/Extension",null,null,null,null,128,{"$f":"0.03*B15","v":0},null,"Kč","R"]
[null,{"$f":"Calculation!C294","v":0},{"$f":"HLOOKUP(Main!$C$2,Translating_products!$CN$4:$DD$216,Translating_products!CM14, FALSE)","v":0},{"$f":"HLOOKUP(Main!$C$2,Translating_products!$DI$4:$DY$216,Translating_products!CM14, FALSE)","v":"Neprodává se"},{"$f":"IF(ISBLANK($Q$1),HLOOKUP(Main!$C$2,Translating_products!$EE$4:$EU$216,Translating_products!CM14,FALSE),HLOOKUP($Q$1,Translating_products!$EE$4:$EU$216,Translating_products!CM14,FALSE))","v":0},0,0,null,"Sonstiges",null,null,null,null,null,"nix",null,"Kč","R"]
[null,{"$f":"Calculation!C295","v":0},{"$f":"HLOOKUP(Main!$C$2,Translating_products!$CN$4:$DD$216,Translating_products!CM15, FALSE)","v":100025},{"$f":"HLOOKUP(Main!$C$2,Translating_products!$DI$4:$DY$216,Translating_products!CM15, FALSE)","v":"Weather Service 1 rok"},{"$f":"IF(ISBLANK($Q$1),HLOOKUP(Main!$C$2,Translating_products!$EE$4:$EU$216,Translating_products!CM15,FALSE),HLOOKUP($Q$1,Translating_products!$EE$4:$EU$216,Translating_products!CM15,FALSE))","v":1238.8399999999999},1498.9963999999998,0,"Sonstiges","Sonstiges",null,null,null,null,null,"nix",null,"Kč","R"]
[null,{"$f":"Calculation!C296","v":0},{"$f":"HLOOKUP(Main!$C$2,Translating_products!$CN$4:$DD$216,Translating_products!CM16, FALSE)","v":100201},{"$f":"HLOOKUP(Main!$C$2,Translating_products!$DI$4:$DY$216,Translating_products!CM16, FALSE)","v":"Weather Service 10 let"},{"$f":"IF(ISBLANK($Q$1),HLOOKUP(Main!$C$2,Translating_products!$EE$4:$EU$216,Translating_products!CM16,FALSE),HLOOKUP($Q$1,Translating_products!$EE$4:$EU$216,Translating_products!CM16,FALSE))","v":7899},9557.7899999999991,0,"Sonstiges","Sonstiges",null,null,null,null,null,"nix",null,"Kč","R"]
[null,{"$f":"Calculation!C297","v":0},{"$f":"HLOOKUP(Main!$C$2,Translating_products!$CN$4:$DD$216,Translating_products!CM17, FALSE)","v":100027},{"$f":"HLOOKUP(Main!$C$2,Translating_products!$DI$4:$DY$216,Translating_products!CM17, FALSE)","v":"Caller Service 1 rok"},{"$f":"IF(ISBLANK($Q$1),HLOOKUP(Main!$C$2,Translating_products!$EE$4:$EU$216,Translating_products!CM17,FALSE),HLOOKUP($Q$1,Translating_products!$EE$4:$EU$216,Translating_products!CM17,FALSE))","v":1238.8399999999999},1498.9963999999998,0,"Sonstiges","Sonstiges",null,null,null,null,null,"nix",null,"Kč","R"]
[null,{"$f":"Calculation!C298","v":1},{"$f":"HLOOKUP(Main!$C$2,Translating_products!$CN$4:$DD$216,Translating_products!CM18, FALSE)","v":100028},{"$f":"HLOOKUP(Main!$C$2,Translating_products!$DI$4:$DY$216,Translating_products!CM18, FALSE)","v":"Caller Service 10 let"},{"$f":"IF(ISBLANK($Q$1),HLOOKUP(Main!$C$2,Translating_products!$EE$4:$EU$216,Translating_products!CM18,FALSE),HLOOKUP($Q$1,Translating_products!$EE$4:$EU$216,Translating_products!CM18,FALSE))","v":7899},9557.7899999999991,9557.7899999999991,"Sonstiges","Sonstiges",null,null,null,null,null,"nix",null,"Kč","R"]
[null,{"$f":"Calculation!C403+Calculation!C79","v":0},{"$f":"HLOOKUP(Main!$C$2,Translating_products!$CN$4:$DD$216,Translating_products!CM19, FALSE)","v":100029},{"$f":"HLOOKUP(Main!$C$2,Translating_products!$DI$4:$DY$216,Translating_products!CM19, FALSE)","v":"Dimmer Extension"},{"$f":"IF(ISBLANK($Q$1),HLOOKUP(Main!$C$2,Translating_products!$EE$4:$EU$216,Translating_products!CM19,FALSE),HLOOKUP($Q$1,Translating_products!$EE$4:$EU$216,Translating_products!CM19,FALSE))","v":9338.02},11299.004199999999,0,"Kein Netzteil 230V Dimmkanal (4 Dimmkanäle = 4 Kanäle)","Licht/Extension",null,8,4,null,null,{"$f":"B21*0.06","v":0},null,"Kč","L"]
[null,{"$f":"Calculation!C299","v":0},{"$f":"HLOOKUP(Main!$C$2,Translating_products!$CN$4:$DD$216,Translating_products!CM20, FALSE)","v":100035},{"$f":"HLOOKUP(Main!$C$2,Translating_products!$DI$4:$DY$216,Translating_products!CM20, FALSE)","v":"IR Set"},{"$f":"IF(ISBLANK($Q$1),HLOOKUP(Main!$C$2,Translating_products!$EE$4:$EU$216,Translating_products!CM20,FALSE),HLOOKUP($Q$1,Translating_products!$EE$4:$EU$216,Translating_products!CM20,FALSE))","v":4131.3999999999996},4998.9939999999997,0,null,"Sonstiges",null,null,null,null,null,0.03,null,"Kč","R"]
[null,{"$f":"Calculation!C404+Calculation!C38","v":2},{"$f":"HLOOKUP(Main!$C$2,Translating_products!$CN$4:$DD$216,Translating_products!CM21, FALSE)","v":100038},{"$f":"HLOOKUP(Main!$C$2,Translating_products!$DI$4:$DY$216,Translating_products!CM21, FALSE)","v":"Relay Extension"},{"$f":"IF(ISBLANK($Q$1),HLOOKUP(Main!$C$2,Translating_products!$EE$4:$EU$216,Translating_products!CM21,FALSE),HLOOKUP($Q$1,Translating_products!$EE$4:$EU$216,Translating_products!CM21,FALSE))","v":9916.5300000000007},11999.0013,23998.0026,null,"Extension",null,null,null,14,null,{"$f":"0.3*B23","v":0.6},null,"Kč","R"]
[null,{"$f":"Calculation!C226+Calculation!C405+Calculation!C44","v":1},{"$f":"HLOOKUP(Main!$C$2,Translating_products!$CN$4:$DD$216,Translating_products!CM22, FALSE)","v":100114},{"$f":"HLOOKUP(Main!$C$2,Translating_products!$DI$4:$DY$216,Translating_products!CM22, FALSE)","v":"Air Base Extension"},{"$f":"IF(ISBLANK($Q$1),HLOOKUP(Main!$C$2,Translating_products!$EE$4:$EU$216,Translating_products!CM22,FALSE),HLOOKUP($Q$1,Translating_products!$EE$4:$EU$216,Translating_products!CM22,FALSE))","v":2099},2539.79,2539.79,"128 Sockets/Geräte gelernt werden","Air/Extension",null,null,null,null,128,6.0000000000000001E-3,null,"Kč","R"]
[null,{"$f":"Calculation!C227","v":2},{"$f":"IF(ISBLANK($Q$1), HLOOKUP(Main!$C$2,Translating_products!$CN$4:$DD$216,Translating_products!CM23,FALSE),HLOOKUP($Q$1,Translating_products!$CN$4:$DD$216,Translating_products!CM23,FALSE))","v":100120},{"$f":"IF(ISBLANK($Q$1),HLOOKUP(Main!$C$2,Translating_products!$DI$4:$DY$216,Translating_products!CM23, FALSE), HLOOKUP($Q$1,Translating_products!$DI$4:$DY$216,Translating_products!CM23, FALSE))","v":"Smart Socket Air Typ E"},{"$f":"IF(ISBLANK($Q$1),HLOOKUP(Main!$C$2,Translating_products!$EE$4:$EU$216,Translating_products!CM23,FALSE),HLOOKUP($Q$1,Translating_products!$EE$4:$EU$216,Translating_products!CM23,FALSE))","v":1499},1813.79,3627.58,"belegt 1 Kanal auf AirBaseExtension","Air",null,null,null,null,1,"nix",null,"Kč","R"]
[null,{"$f":"Calculation!C228+Calculation!C406","v":0},{"$f":"HLOOKUP(Main!$C$2,Translating_products!$CN$4:$DD$216,Translating_products!CM24, FALSE)","v":100116},{"$f":"HLOOKUP(Main!$C$2,Translating_products!$DI$4:$DY$216,Translating_products!CM24, FALSE)","v":"Multi Extension Air"},{"$f":"IF(ISBLANK($Q$1),HLOOKUP(Main!$C$2,Translating_products!$EE$4:$EU$216,Translating_products!CM24,FALSE),HLOOKUP($Q$1,Translating_products!$EE$4:$EU$216,Translating_products!CM24,FALSE))","v":9916.5300000000007},11999.0013,0,"Stück-Auswahl","Air/Extension",null,12,null,8,20,"0,4 A Netzt. Pro Ext.",null,"Kč","R"]
[null,{"$f":"Calculation!C80","v":0},{"$f":"HLOOKUP(Main!$C$2,Translating_products!$CN$4:$DD$216,Translating_products!CM25, FALSE)","v":100117},{"$f":"HLOOKUP(Main!$C$2,Translating_products!$DI$4:$DY$216,Translating_products!CM25, FALSE)","v":"RGBW 24V Dimmer DMX"},{"$f":"IF(ISBLANK($Q$1),HLOOKUP(Main!$C$2,Translating_products!$EE$4:$EU$216,Translating_products!CM25,FALSE),HLOOKUP($Q$1,Translating_products!$EE$4:$EU$216,Translating_products!CM25,FALSE))","v":1499},1813.79,0,"belegt 4Kanäle auf DMX Extension","Licht",null,null,null,null,4,"nix",null,"Kč","L"]
[null,{"$f":"Calculation!C402","v":0},{"$f":"HLOOKUP(Main!$C$2,Translating_products!$CN$4:$DD$216,Translating_products!CM26, FALSE)","v":100124},{"$f":"HLOOKUP(Main!$C$2,Translating_products!$DI$4:$DY$216,Translating_products!CM26, FALSE)","v":"Modbus Extension"},{"$f":"IF(ISBLANK($Q$1),HLOOKUP(Main!$C$2,Translating_products!$EE$4:$EU$216,Translating_products!CM26,FALSE),HLOOKUP($Q$1,Translating_products!$EE$4:$EU$216,Translating_products!CM26,FALSE))","v":4799},5806.79,0,"Sonstiges-Auswählen","Sonstiges",null,null,null,null,null,{"$f":"B28*0.03","v":0},null,"Kč","R"]
[null,{"$f":"Calculation!C81","v":0},{"$f":"HLOOKUP(Main!$C$2,Translating_products!$CN$4:$DD$216,Translating_products!CM27, FALSE)","v":100125},{"$f":"HLOOKUP(Main!$C$2,Translating_products!$DI$4:$DY$216,Translating_products!CM27, FALSE)","v":"RGBW 24V Dimmer Air"},{"$f":"IF(ISBLANK($Q$1),HLOOKUP(Main!$C$2,Translating_products!$EE$4:$EU$216,Translating_products!CM27,FALSE),HLOOKUP($Q$1,Translating_products!$EE$4:$EU$216,Translating_products!CM27,FALSE))","v":1849},2237.29,0,"belegt 1 Kanal auf AirbaseExtension","Licht",null,null,null,null,1,"nix",null,"Kč","L"]
[null,{"$f":"Calculation!C229+Calculation!C407+Calculation!C6","v":0},{"$f":"HLOOKUP(Main!$C$2,Translating_products!$CN$4:$DD$216,Translating_products!CM28, FALSE)","v":100139},{"$f":"HLOOKUP(Main!$C$2,Translating_products!$DI$4:$DY$216,Translating_products!CM28, FALSE)","v":"Miniserver Go"},{"$f":"IF(ISBLANK($Q$1),HLOOKUP(Main!$C$2,Translating_products!$EE$4:$EU$216,Translating_products!CM28,FALSE),HLOOKUP($Q$1,Translating_products!$EE$4:$EU$216,Translating_products!CM28,FALSE))","v":8263.6299999999992},9998.9922999999981,0,"wird ausgewählt (für Nachrüster)","Air/Extension",null,null,null,null,128,"nix",null,"Kč","R"]
[null,{"$f":"Calculation!C230","v":1},{"$f":"HLOOKUP(Main!$C$2,Translating_products!$CN$4:$DD$216,Translating_products!CM29, FALSE)","v":100140},{"$f":"HLOOKUP(Main!$C$2,Translating_products!$DI$4:$DY$216,Translating_products!CM29, FALSE)","v":"Remote Air"},{"$f":"IF(ISBLANK($Q$1),HLOOKUP(Main!$C$2,Translating_products!$EE$4:$EU$216,Translating_products!CM29,FALSE),HLOOKUP($Q$1,Translating_products!$EE$4:$EU$216,Translating_products!CM29,FALSE))","v":1099},1329.79,1329.79,"belegt 1 Kanal auf MsGo oder Extension","Air",null,null,null,null,1,"nix",null,"Kč","R"]
[null,{"$f":"Calculation!C231","v":0},{"$f":"HLOOKUP(Main!$C$2,Translating_products!$CN$4:$DD$216,Translating_products!CM30, FALSE)","v":100141},{"$f":"HLOOKUP(Main!$C$2,Translating_products!$DI$4:$DY$216,Translating_products!CM30, FALSE)","v":"IR Control Air"},{"$f":"IF(ISBLANK($Q$1),HLOOKUP(Main!$C$2,Translating_products!$EE$4:$EU$216,Translating_products!CM30,FALSE),HLOOKUP($Q$1,Translating_products!$EE$4:$EU$216,Translating_products!CM30,FALSE))","v":2499},3023.79,0,"belegt 1 Kanal auf MsGo oder Extension","Air",null,null,null,null,1,"nix",null,"Kč","R"]
[null,{"$f":"Calculation!C232","v":3},{"$f":"HLOOKUP(Main!$C$2,Translating_products!$CN$4:$DD$216,Translating_products!CM31, FALSE)","v":100142},{"$f":"HLOOKUP(Main!$C$2,Translating_products!$DI$4:$DY$216,Translating_products!CM31, FALSE)","v":"Detektor kouře Air"},{"$f":"IF(ISBLANK($Q$1),HLOOKUP(Main!$C$2,Translating_products!$EE$4:$EU$216,Translating_products!CM31,FALSE),HLOOKUP($Q$1,Translating_products!$EE$4:$EU$216,Translating_products!CM31,FALSE))","v":2049},2479.29,7437.87,"belegt 1 Kanal auf MsGo oder Extension","Air",null,null,null,null,1,"nix",null,"Kč","R"]
[null,{"$f":"Calculation!C233","v":0},{"$f":"HLOOKUP(Main!$C$2,Translating_products!$CN$4:$DD$216,Translating_products!CM32, FALSE)","v":100149},{"$f":"HLOOKUP(Main!$C$2,Translating_products!$DI$4:$DY$216,Translating_products!CM32, FALSE)","v":"Senzor teploty & vlhkosti Air"},{"$f":"IF(ISBLANK($Q$1),HLOOKUP(Main!$C$2,Translating_products!$EE$4:$EU$216,Translating_products!CM32,FALSE),HLOOKUP($Q$1,Translating_products!$EE$4:$EU$216,Translating_products!CM32,FALSE))","v":1899},2297.79,0,"belegt 1 Kanal auf MsGo oder Extension","Air",null,null,null,null,1,"nix",null,"Kč","R"]
[null,{"$f":"Calculation!C221","v":0},{"$f":"HLOOKUP(Main!$C$2,Translating_products!$CN$4:$DD$216,Translating_products!CM33, FALSE)","v":100150},{"$f":"HLOOKUP(Main!$C$2,Translating_products!$DI$4:$DY$216,Translating_products!CM33, FALSE)","v":"Loxone set nářadí"},{"$f":"IF(ISBLANK($Q$1),HLOOKUP(Main!$C$2,Translating_products!$EE$4:$EU$216,Translating_products!CM33,FALSE),HLOOKUP($Q$1,Translating_products!$EE$4:$EU$216,Translating_products!CM33,FALSE))","v":8399},10162.789999999999,0,"Stück-Auswahl Sonstiges","Sonstiges",null,null,null,null,null,"nix",null,"Kč","R"]
[null,{"$f":"Calculation!C234","v":0},{"$f":"HLOOKUP(Main!$C$2,Translating_products!$CN$4:$DD$216,Translating_products!CM34, FALSE)","v":100151},{"$f":"HLOOKUP(Main!$C$2,Translating_products!$DI$4:$DY$216,Translating_products!CM34, FALSE)","v":"IR Elektroměr Air"},{"$f":"IF(ISBLANK($Q$1),HLOOKUP(Main!$C$2,Translating_products!$EE$4:$EU$216,Translating_products!CM34,FALSE),HLOOKUP($Q$1,Translating_products!$EE$4:$EU$216,Translating_products!CM34,FALSE))","v":2099},2539.79,0,"belegt 1 Kanal auf MsGo oder Extension","Air",null,null,null,null,1,"nix",null,"Kč","R"]
[null,{"$f":"Calculation!C250+Calculation!C94+Calculation!C348","v":0},{"$f":"HLOOKUP(Main!$C$2,Translating_products!$CN$4:$DD$216,Translating_products!CM35, FALSE)","v":100153},{"$f":"HLOOKUP(Main!$C$2,Translating_products!$DI$4:$DY$216,Translating_products!CM35, FALSE)","v":"Nano IO Air"},{"$f":"IF(ISBLANK($Q$1),HLOOKUP(Main!$C$2,Translating_products!$EE$4:$EU$216,Translating_products!CM35,FALSE),HLOOKUP($Q$1,Translating_products!$EE$4:$EU$216,Translating_products!CM35,FALSE))","v":2499},3023.79,0,"belegt 1 Kanal auf MsGo oder Extension","Beschattung",null,null,null,null,1,"nix",null,"Kč","L"]
[null,{"$f":"Calculation!C235+Calculation!C376","v":0},{"$f":"HLOOKUP(Main!$C$2,Translating_products!$CN$4:$DD$216,Translating_products!CM36, FALSE)","v":100154},{"$f":"HLOOKUP(Main!$C$2,Translating_products!$DI$4:$DY$216,Translating_products!CM36, FALSE)","v":"Loxone Touch for Nano Bílá"},{"$f":"IF(ISBLANK($Q$1),HLOOKUP(Main!$C$2,Translating_products!$EE$4:$EU$216,Translating_products!CM36,FALSE),HLOOKUP($Q$1,Translating_products!$EE$4:$EU$216,Translating_products!CM36,FALSE))","v":1049},1269.29,0,null,"Air",null,null,null,null,null,"nix",null,"Kč","R"]
[null,{"$f":"Calculation!C236+Calculation!C377","v":0},{"$f":"HLOOKUP(Main!$C$2,Translating_products!$CN$4:$DD$216,Translating_products!CM37, FALSE)","v":100155},{"$f":"HLOOKUP(Main!$C$2,Translating_products!$DI$4:$DY$216,Translating_products!CM37, FALSE)","v":"Loxone Touch Air Bílá"},{"$f":"IF(ISBLANK($Q$1),HLOOKUP(Main!$C$2,Translating_products!$EE$4:$EU$216,Translating_products!CM37,FALSE),HLOOKUP($Q$1,Translating_products!$EE$4:$EU$216,Translating_products!CM37,FALSE))","v":2499},{"$f":"E39*(1+$E$197*0.01)","v":3023.79},0,"belegt 1 Kanal auf MsGo oder Extension","Air",null,null,null,null,1,"nix",null,"Kč","R"]
[null,{"$f":"Calculation!C408","v":0},{"$f":"HLOOKUP(Main!$C$2,Translating_products!$CN$4:$DD$216,Translating_products!CM38, FALSE)","v":100158},{"$f":"HLOOKUP(Main!$C$2,Translating_products!$DI$4:$DY$216,Translating_products!CM38, FALSE)","v":"Fröling Extension"},{"$f":"IF(ISBLANK($Q$1),HLOOKUP(Main!$C$2,Translating_products!$EE$4:$EU$216,Translating_products!CM38,FALSE),HLOOKUP($Q$1,Translating_products!$EE$4:$EU$216,Translating_products!CM38,FALSE))","v":4499},5443.79,0,"Sonstiges -kann man einfach kaufen","Sonstiges",null,null,null,null,null,0.03,null,"Kč","H"]
[null,{"$f":"Calculation!C237+Calculation!C136","v":0},{"$f":"HLOOKUP(Main!$C$2,Translating_products!$CN$4:$DD$216,Translating_products!CM39, FALSE)","v":100163},{"$f":"HLOOKUP(Main!$C$2,Translating_products!$DI$4:$DY$216,Translating_products!CM39, FALSE)","v":"Hlavice Air"},{"$f":"IF(ISBLANK($Q$1),HLOOKUP(Main!$C$2,Translating_products!$EE$4:$EU$216,Translating_products!CM39,FALSE),HLOOKUP($Q$1,Translating_products!$EE$4:$EU$216,Translating_products!CM39,FALSE))","v":2099},2539.79,0,"belegt 1 Kanal auf MsGo oder Extension","Air",null,null,null,null,1,"nix",null,"Kč","H"]
[null,{"$f":"Calculation!C120+Calculation!H122","v":1},{"$f":"HLOOKUP(Main!$C$2,Translating_products!$CN$4:$DD$216,Translating_products!CM40, FALSE)","v":100165},{"$f":"HLOOKUP(Main!$C$2,Translating_products!$DI$4:$DY$216,Translating_products!CM40, FALSE)","v":"Loxone Music Server 4 Zóny"},{"$f":"IF(ISBLANK($Q$1),HLOOKUP(Main!$C$2,Translating_products!$EE$4:$EU$216,Translating_products!CM40,FALSE),HLOOKUP($Q$1,Translating_products!$EE$4:$EU$216,Translating_products!CM40,FALSE))","v":31999},38718.79,38718.79,"Stück-Auswahl","Musik",null,null,null,null,null,"nix",null,"Kč","M"]
[null,{"$f":"Calculation!C121+Calculation!H123","v":0},{"$f":"HLOOKUP(Main!$C$2,Translating_products!$CN$4:$DD$216,Translating_products!CM41, FALSE)","v":100166},{"$f":"HLOOKUP(Main!$C$2,Translating_products!$DI$4:$DY$216,Translating_products!CM41, FALSE)","v":"Loxone Music Server 8 Zón"},{"$f":"IF(ISBLANK($Q$1),HLOOKUP(Main!$C$2,Translating_products!$EE$4:$EU$216,Translating_products!CM41,FALSE),HLOOKUP($Q$1,Translating_products!$EE$4:$EU$216,Translating_products!CM41,FALSE))","v":44999},54448.79,0,"Stück-Auswahl","Musik",null,null,null,null,null,"nix",null,"Kč","M"]
[null,{"$f":"Calculation!C122+Calculation!H124","v":0},{"$f":"HLOOKUP(Main!$C$2,Translating_products!$CN$4:$DD$216,Translating_products!CM42, FALSE)","v":100167},{"$f":"HLOOKUP(Main!$C$2,Translating_products!$DI$4:$DY$216,Translating_products!CM42, FALSE)","v":"Loxone Music Server 12 Zón"},{"$f":"IF(ISBLANK($Q$1),HLOOKUP(Main!$C$2,Translating_products!$EE$4:$EU$216,Translating_products!CM42,FALSE),HLOOKUP($Q$1,Translating_products!$EE$4:$EU$216,Translating_products!CM42,FALSE))","v":52499},63523.79,0,"Stück-Auswahl","Musik",null,null,null,null,null,"nix",null,"Kč","M"]
[null,{"$f":"Calculation!C123+Calculation!H125","v":0},{"$f":"HLOOKUP(Main!$C$2,Translating_products!$CN$4:$DD$216,Translating_products!CM43, FALSE)","v":100168},{"$f":"HLOOKUP(Main!$C$2,Translating_products!$DI$4:$DY$216,Translating_products!CM43, FALSE)","v":"Loxone Music Server 16 Zón"},{"$f":"IF(ISBLANK($Q$1),HLOOKUP(Main!$C$2,Translating_products!$EE$4:$EU$216,Translating_products!CM43,FALSE),HLOOKUP($Q$1,Translating_products!$EE$4:$EU$216,Translating_products!CM43,FALSE))","v":64999},78648.789999999994,0,"Stück-Auswahl","Musik",null,null,null,null,null,"nix",null,"Kč","M"]
[null,{"$f":"Calculation!C124+Calculation!H126","v":0},{"$f":"HLOOKUP(Main!$C$2,Translating_products!$CN$4:$DD$216,Translating_products!CM44, FALSE)","v":100169},{"$f":"HLOOKUP(Main!$C$2,Translating_products!$DI$4:$DY$216,Translating_products!CM44, FALSE)","v":"Loxone Music Server 20 Zón"},{"$f":"IF(ISBLANK($Q$1),HLOOKUP(Main!$C$2,Translating_products!$EE$4:$EU$216,Translating_products!CM44,FALSE),HLOOKUP($Q$1,Translating_products!$EE$4:$EU$216,Translating_products!CM44,FALSE))","v":74999},90748.79,0,"Stück-Auswahl","Musik",null,null,null,null,null,"nix",null,"Kč","M"]
[null,{"$f":"Calculation!C336","v":0},{"$f":"HLOOKUP(Main!$C$2,Translating_products!$CN$4:$DD$216,Translating_products!CM45, FALSE)","v":"not available in this country"},{"$f":"HLOOKUP(Main!$C$2,Translating_products!$DI$4:$DY$216,Translating_products!CM45, FALSE)","v":"not available in this country"},{"$f":"IF(ISBLANK($Q$1),HLOOKUP(Main!$C$2,Translating_products!$EE$4:$EU$216,Translating_products!CM45,FALSE),HLOOKUP($Q$1,Translating_products!$EE$4:$EU$216,Translating_products!CM45,FALSE))","v":0},0,0,"Stück-Auswahl","Sonstiges",null,null,null,null,null,"nix",null,"Kč","R"]
[null,{"$f":"Calculation!C301","v":0},{"$f":"HLOOKUP(Main!$C$2,Translating_products!$CN$4:$DD$216,Translating_products!CM46, FALSE)","v":100178},{"$f":"HLOOKUP(Main!$C$2,Translating_products!$DI$4:$DY$216,Translating_products!CM46, FALSE)","v":"AquaStar Air 1.5\""},{"$f":"IF(ISBLANK($Q$1),HLOOKUP(Main!$C$2,Translating_products!$EE$4:$EU$216,Translating_products!CM46,FALSE),HLOOKUP($Q$1,Translating_products!$EE$4:$EU$216,Translating_products!CM46,FALSE))","v":38999},47188.79,0,"Stück-Auswahl","Sonstiges",null,null,null,null,null,"nix",null,"Kč","R"]
[null,{"$f":"Calculation!C302","v":0},{"$f":"HLOOKUP(Main!$C$2,Translating_products!$CN$4:$DD$216,Translating_products!CM47, FALSE)","v":100179},{"$f":"HLOOKUP(Main!$C$2,Translating_products!$DI$4:$DY$216,Translating_products!CM47, FALSE)","v":"AquaStar Air 2\""},{"$f":"IF(ISBLANK($Q$1),HLOOKUP(Main!$C$2,Translating_products!$EE$4:$EU$216,Translating_products!CM47,FALSE),HLOOKUP($Q$1,Translating_products!$EE$4:$EU$216,Translating_products!CM47,FALSE))","v":51999},62918.79,0,"Stück-Auswahl","Sonstiges",null,null,null,null,null,"nix",null,"Kč","R"]
[null,{"$f":"Calculation!C244+Calculation!C379","v":0},{"$f":"HLOOKUP(Main!$C$2,Translating_products!$CN$4:$DD$216,Translating_products!CM48, FALSE)","v":100180},{"$f":"HLOOKUP(Main!$C$2,Translating_products!$DI$4:$DY$216,Translating_products!CM48, FALSE)","v":"Loxone Touch Air Anthrazit"},{"$f":"IF(ISBLANK($Q$1),HLOOKUP(Main!$C$2,Translating_products!$EE$4:$EU$216,Translating_products!CM48,FALSE),HLOOKUP($Q$1,Translating_products!$EE$4:$EU$216,Translating_products!CM48,FALSE))","v":2499},3023.79,0,"belegt 1 Kanal auf MsGo oder Extension","Air",null,null,null,null,1,"nix",null,"Kč","R"]
[null,{"$f":"Calculation!C245+Calculation!C380","v":0},{"$f":"HLOOKUP(Main!$C$2,Translating_products!$CN$4:$DD$216,Translating_products!CM49, FALSE)","v":100181},{"$f":"HLOOKUP(Main!$C$2,Translating_products!$DI$4:$DY$216,Translating_products!CM49, FALSE)","v":"Loxone Touch for Nano Anthrazit"},{"$f":"IF(ISBLANK($Q$1),HLOOKUP(Main!$C$2,Translating_products!$EE$4:$EU$216,Translating_products!CM49,FALSE),HLOOKUP($Q$1,Translating_products!$EE$4:$EU$216,Translating_products!CM49,FALSE))","v":1049},1269.29,0,null,"Air",null,null,null,null,null,"nix",null,"Kč","R"]
[null,{"$f":"Calculation!C246+Calculation!C350","v":0},{"$f":"HLOOKUP(Main!$C$2,Translating_products!$CN$4:$DD$216,Translating_products!CM50, FALSE)","v":100182},{"$f":"HLOOKUP(Main!$C$2,Translating_products!$DI$4:$DY$216,Translating_products!CM50, FALSE)","v":"Trubkový Motor SOLIDline Air 10Nm"},{"$f":"IF(ISBLANK($Q$1),HLOOKUP(Main!$C$2,Translating_products!$EE$4:$EU$216,Translating_products!CM50,FALSE),HLOOKUP($Q$1,Translating_products!$EE$4:$EU$216,Translating_products!CM50,FALSE))","v":4499},5443.79,0,"belegt 1 Kanal auf MsGo oder Extension","Air",null,null,null,null,1,"nix",null,"Kč","B"]
[null,{"$f":"Calculation!C247+Calculation!C351","v":0},{"$f":"HLOOKUP(Main!$C$2,Translating_products!$CN$4:$DD$216,Translating_products!CM51, FALSE)","v":100183},{"$f":"HLOOKUP(Main!$C$2,Translating_products!$DI$4:$DY$216,Translating_products!CM51, FALSE)","v":"Trubkový Motor SOLIDline Air 20Nm"},{"$f":"IF(ISBLANK($Q$1),HLOOKUP(Main!$C$2,Translating_products!$EE$4:$EU$216,Translating_products!CM51,FALSE),HLOOKUP($Q$1,Translating_products!$EE$4:$EU$216,Translating_products!CM51,FALSE))","v":4999},6048.79,0,"belegt 1 Kanal auf MsGo oder Extension","Air",null,null,null,null,1,"nix",null,"Kč","B"]
[null,{"$f":"Calculation!C248+Calculation!C352","v":0},{"$f":"HLOOKUP(Main!$C$2,Translating_products!$CN$4:$DD$216,Translating_products!CM52, FALSE)","v":100184},{"$f":"HLOOKUP(Main!$C$2,Translating_products!$DI$4:$DY$216,Translating_products!CM52, FALSE)","v":"Trubkový Motor SOLIDline Air 50Nm"},{"$f":"IF(ISBLANK($Q$1),HLOOKUP(Main!$C$2,Translating_products!$EE$4:$EU$216,Translating_products!CM52,FALSE),HLOOKUP($Q$1,Translating_products!$EE$4:$EU$216,Translating_products!CM52,FALSE))","v":5799},7016.79,0,"belegt 1 Kanal auf MsGo oder Extension","Air",null,null,null,null,1,"nix",null,"Kč","B"]
[null,{"$f":"Calculation!C303+Calculation!L417","v":2},{"$f":"HLOOKUP(Main!$C$2,Translating_products!$CN$4:$DD$216,Translating_products!CM53, FALSE)","v":200001},{"$f":"HLOOKUP(Main!$C$2,Translating_products!$DI$4:$DY$216,Translating_products!CM53, FALSE)","v":"24V Zdroj (1.3A)"},{"$f":"IF(ISBLANK($Q$1),HLOOKUP(Main!$C$2,Translating_products!$EE$4:$EU$216,Translating_products!CM53,FALSE),HLOOKUP($Q$1,Translating_products!$EE$4:$EU$216,Translating_products!CM53,FALSE))","v":908.26},1098.9946,2197.9892,"Auswählen & stehen auch mit anderen Produkten in Beziehung","Sonstiges",null,null,null,null,null,"nix",null,"Kč","R"]
[null,{"$f":"Calculation!C304+Calculation!L418","v":1},{"$f":"HLOOKUP(Main!$C$2,Translating_products!$CN$4:$DD$216,Translating_products!CM54, FALSE)","v":200002},{"$f":"HLOOKUP(Main!$C$2,Translating_products!$DI$4:$DY$216,Translating_products!CM54, FALSE)","v":"24V Zdroj (4.2A)"},{"$f":"IF(ISBLANK($Q$1),HLOOKUP(Main!$C$2,Translating_products!$EE$4:$EU$216,Translating_products!CM54,FALSE),HLOOKUP($Q$1,Translating_products!$EE$4:$EU$216,Translating_products!CM54,FALSE))","v":1404.13},1698.9973,1698.9973,"Auswählen & stehen auch mit anderen Produkten in Beziehung","Sonstiges",null,null,null,null,null,"nix",null,"Kč","R"]
[null,{"$f":"Calculation!C137+Calculation!C171","v":0},{"$f":"HLOOKUP(Main!$C$2,Translating_products!$CN$4:$DD$216,Translating_products!CM55, FALSE)","v":200003},{"$f":"HLOOKUP(Main!$C$2,Translating_products!$DI$4:$DY$216,Translating_products!CM55, FALSE)","v":"Venkovní senzor teploty"},{"$f":"IF(ISBLANK($Q$1),HLOOKUP(Main!$C$2,Translating_products!$EE$4:$EU$216,Translating_products!CM55,FALSE),HLOOKUP($Q$1,Translating_products!$EE$4:$EU$216,Translating_products!CM55,FALSE))","v":1032.23},1248.9983,0,null,"Heizung",1,null,null,null,null,{"$f":"B57*0.005","v":0},null,"Kč","H"]
[null,0,{"$f":"HLOOKUP(Main!$C$2,Translating_products!$CN$4:$DD$216,Translating_products!CM56, FALSE)","v":0},{"$f":"HLOOKUP(Main!$C$2,Translating_products!$DI$4:$DY$216,Translating_products!CM56, FALSE)","v":"No longer sold"},{"$f":"IF(ISBLANK($Q$1),HLOOKUP(Main!$C$2,Translating_products!$EE$4:$EU$216,Translating_products!CM56,FALSE),HLOOKUP($Q$1,Translating_products!$EE$4:$EU$216,Translating_products!CM56,FALSE))","v":0},0,0,null,"Heizung",null,null,1,null,null,{"$f":"B58*0.27","v":0},null,"Kč","R"]
[null,0,{"$f":"HLOOKUP(Main!$C$2,Translating_products!$CN$4:$DD$216,Translating_products!CM57, FALSE)","v":0},{"$f":"HLOOKUP(Main!$C$2,Translating_products!$DI$4:$DY$216,Translating_products!CM57, FALSE)","v":"No longer sold"},{"$f":"IF(ISBLANK($Q$1),HLOOKUP(Main!$C$2,Translating_products!$EE$4:$EU$216,Translating_products!CM57,FALSE),HLOOKUP($Q$1,Translating_products!$EE$4:$EU$216,Translating_products!CM57,FALSE))","v":0},0,0,null,"Heizung",null,null,null,1,null,"nix",null,"Kč","R"]
[null,{"$f":"Calculation!C138+Calculation!C172","v":0},{"$f":"HLOOKUP(Main!$C$2,Translating_products!$CN$4:$DD$216,Translating_products!CM58, FALSE)","v":200006},{"$f":"HLOOKUP(Main!$C$2,Translating_products!$DI$4:$DY$216,Translating_products!CM58, FALSE)","v":"Vnitřní teplotní senzor 0-10V"},{"$f":"IF(ISBLANK($Q$1),HLOOKUP(Main!$C$2,Translating_products!$EE$4:$EU$216,Translating_products!CM58,FALSE),HLOOKUP($Q$1,Translating_products!$EE$4:$EU$216,Translating_products!CM58,FALSE))","v":1032.23},1248.9983,0,null,"Heizung",1,null,null,null,null,{"$f":"B60*0.005","v":0},null,"Kč","H"]
[null,{"$f":"Calculation!C305","v":0},{"$f":"HLOOKUP(Main!$C$2,Translating_products!$CN$4:$DD$216,Translating_products!CM59, FALSE)","v":"not available in this country"},{"$f":"HLOOKUP(Main!$C$2,Translating_products!$DI$4:$DY$216,Translating_products!CM59, FALSE)","v":"not available in this country"},{"$f":"IF(ISBLANK($Q$1),HLOOKUP(Main!$C$2,Translating_products!$EE$4:$EU$216,Translating_products!CM59,FALSE),HLOOKUP($Q$1,Translating_products!$EE$4:$EU$216,Translating_products!CM59,FALSE))","v":0},0,0,"Sonstiges-Stück","Sonstiges",null,null,null,null,null,"nix",null,"Kč","R"]
[null,{"$f":"Calculation!C139+Calculation!C173","v":0},{"$f":"HLOOKUP(Main!$C$2,Translating_products!$CN$4:$DD$216,Translating_products!CM60, FALSE)","v":200010},{"$f":"HLOOKUP(Main!$C$2,Translating_products!$DI$4:$DY$216,Translating_products!CM60, FALSE)","v":"Senzor teploty a vlhkosti (vnitřní) 0-10V"},{"$f":"IF(ISBLANK($Q$1),HLOOKUP(Main!$C$2,Translating_products!$EE$4:$EU$216,Translating_products!CM60,FALSE),HLOOKUP($Q$1,Translating_products!$EE$4:$EU$216,Translating_products!CM60,FALSE))","v":2189.2600000000002},2649.0046000000002,0,null,"Heizung",2,null,null,null,null,{"$f":"B62*0.005","v":0},null,"Kč","H"]
[null,{"$f":"Calculation!C306","v":0},{"$f":"HLOOKUP(Main!$C$2,Translating_products!$CN$4:$DD$216,Translating_products!CM61, FALSE)","v":200012},{"$f":"HLOOKUP(Main!$C$2,Translating_products!$DI$4:$DY$216,Translating_products!CM61, FALSE)","v":"Adaptér ventilu VA80"},{"$f":"IF(ISBLANK($Q$1),HLOOKUP(Main!$C$2,Translating_products!$EE$4:$EU$216,Translating_products!CM61,FALSE),HLOOKUP($Q$1,Translating_products!$EE$4:$EU$216,Translating_products!CM61,FALSE))","v":29.75},35.997500000000002,0,"Sonstiges-Stück","Sonstiges",null,null,null,null,null,"nix",null,"Kč","H"]
[null,{"$f":"Calculation!C307","v":0},{"$f":"HLOOKUP(Main!$C$2,Translating_products!$CN$4:$DD$216,Translating_products!CM62, FALSE)","v":"not available in this country"},{"$f":"HLOOKUP(Main!$C$2,Translating_products!$DI$4:$DY$216,Translating_products!CM62, FALSE)","v":"not available in this country"},{"$f":"IF(ISBLANK($Q$1),HLOOKUP(Main!$C$2,Translating_products!$EE$4:$EU$216,Translating_products!CM62,FALSE),HLOOKUP($Q$1,Translating_products!$EE$4:$EU$216,Translating_products!CM62,FALSE))","v":0},0,0,"Sonstiges-Stück","Sonstiges",null,null,null,null,null,"nix",null,"Kč","R"]
[null,{"$f":"Calculation!C140+Calculation!C174","v":0},{"$f":"HLOOKUP(Main!$C$2,Translating_products!$CN$4:$DD$216,Translating_products!CM63, FALSE)","v":200017},{"$f":"HLOOKUP(Main!$C$2,Translating_products!$DI$4:$DY$216,Translating_products!CM63, FALSE)","v":"Senzor CO2/Teplota/Vlhkost"},{"$f":"IF(ISBLANK($Q$1),HLOOKUP(Main!$C$2,Translating_products!$EE$4:$EU$216,Translating_products!CM63,FALSE),HLOOKUP($Q$1,Translating_products!$EE$4:$EU$216,Translating_products!CM63,FALSE))","v":5784.3},6999.0029999999997,0,null,"Heizung",3,null,null,null,null,{"$f":"B65*0.01","v":0},null,"Kč","H"]
[null,{"$f":"Calculation!C175","v":0},{"$f":"HLOOKUP(Main!$C$2,Translating_products!$CN$4:$DD$216,Translating_products!CM64, FALSE)","v":200018},{"$f":"HLOOKUP(Main!$C$2,Translating_products!$DI$4:$DY$216,Translating_products!CM64, FALSE)","v":"Dešťový senzor (24V)"},{"$f":"IF(ISBLANK($Q$1),HLOOKUP(Main!$C$2,Translating_products!$EE$4:$EU$216,Translating_products!CM64,FALSE),HLOOKUP($Q$1,Translating_products!$EE$4:$EU$216,Translating_products!CM64,FALSE))","v":1445.45},1748.9945,0,null,"Sensoren",null,1,null,null,null,{"$f":"0.06*B66","v":0},null,"Kč","B"]
[null,{"$f":"Calculation!C176","v":0},{"$f":"HLOOKUP(Main!$C$2,Translating_products!$CN$4:$DD$216,Translating_products!CM65, FALSE)","v":200031},{"$f":"HLOOKUP(Main!$C$2,Translating_products!$DI$4:$DY$216,Translating_products!CM65, FALSE)","v":"Senzor teploty a vlhkosti (venkovní)"},{"$f":"IF(ISBLANK($Q$1),HLOOKUP(Main!$C$2,Translating_products!$EE$4:$EU$216,Translating_products!CM65,FALSE),HLOOKUP($Q$1,Translating_products!$EE$4:$EU$216,Translating_products!CM65,FALSE))","v":2933.06},3549.0025999999998,0,null,"Sensoren",2,null,null,null,null,{"$f":"B67*0.005","v":0},null,"Kč","H"]
[null,{"$f":"Calculation!C177","v":0},{"$f":"HLOOKUP(Main!$C$2,Translating_products!$CN$4:$DD$216,Translating_products!CM66, FALSE)","v":200032},{"$f":"HLOOKUP(Main!$C$2,Translating_products!$DI$4:$DY$216,Translating_products!CM66, FALSE)","v":"Senzor osvětlení 0-10V"},{"$f":"IF(ISBLANK($Q$1),HLOOKUP(Main!$C$2,Translating_products!$EE$4:$EU$216,Translating_products!CM66,FALSE),HLOOKUP($Q$1,Translating_products!$EE$4:$EU$216,Translating_products!CM66,FALSE))","v":1982.64},2398.9944,0,null,"Sensoren",1,null,null,null,null,{"$f":"0.005*B68","v":0},null,"Kč","B"]
[null,{"$f":"Calculation!C178","v":0},{"$f":"HLOOKUP(Main!$C$2,Translating_products!$CN$4:$DD$216,Translating_products!CM67, FALSE)","v":200033},{"$f":"HLOOKUP(Main!$C$2,Translating_products!$DI$4:$DY$216,Translating_products!CM67, FALSE)","v":"Senzor větru (24V)"},{"$f":"IF(ISBLANK($Q$1),HLOOKUP(Main!$C$2,Translating_products!$EE$4:$EU$216,Translating_products!CM67,FALSE),HLOOKUP($Q$1,Translating_products!$EE$4:$EU$216,Translating_products!CM67,FALSE))","v":1817.36},2199.0056,0,null,"Sensoren",null,1,null,null,null,"nix",null,"Kč","B"]
[null,{"$f":"Calculation!C179","v":0},{"$f":"HLOOKUP(Main!$C$2,Translating_products!$CN$4:$DD$216,Translating_products!CM68, FALSE)","v":200034},{"$f":"HLOOKUP(Main!$C$2,Translating_products!$DI$4:$DY$216,Translating_products!CM68, FALSE)","v":"Držák pro senzor větru"},{"$f":"IF(ISBLANK($Q$1),HLOOKUP(Main!$C$2,Translating_products!$EE$4:$EU$216,Translating_products!CM68,FALSE),HLOOKUP($Q$1,Translating_products!$EE$4:$EU$216,Translating_products!CM68,FALSE))","v":1362.81},1649.0001,0,"Stück-Auswahl","Sensoren",null,null,null,null,null,"nix",null,"Kč","B"]
[null,{"$f":"Calculation!C308+Calculation!L419","v":2},{"$f":"HLOOKUP(Main!$C$2,Translating_products!$CN$4:$DD$216,Translating_products!CM69, FALSE)","v":200035},{"$f":"HLOOKUP(Main!$C$2,Translating_products!$DI$4:$DY$216,Translating_products!CM69, FALSE)","v":"24V Zdroj (10A)"},{"$f":"IF(ISBLANK($Q$1),HLOOKUP(Main!$C$2,Translating_products!$EE$4:$EU$216,Translating_products!CM69,FALSE),HLOOKUP($Q$1,Translating_products!$EE$4:$EU$216,Translating_products!CM69,FALSE))","v":3304.96},{"$f":"E71*(1+$E$197*0.01)","v":3999.0016000000001},7998.0032000000001,"Stück-Auswahl","Sonstiges",null,null,null,null,null,"nix",null,"Kč","R"]
[null,{"$f":"Calculation!C309","v":0},{"$f":"HLOOKUP(Main!$C$2,Translating_products!$CN$4:$DD$216,Translating_products!CM71, FALSE)","v":200040},{"$f":"IF(ISBLANK(Q1),HLOOKUP(Main!$C$2,Translating_products!$DI$4:$DY$216,Translating_products!CM71,FALSE),\"Not available in this country\")","v":"Instalační krabice IP20 bílá"},{"$f":"IF(ISBLANK($Q$1),HLOOKUP(Main!$C$2,Translating_products!$EE$4:$EU$216,Translating_products!CM71,FALSE),HLOOKUP($Q$1,Translating_products!$EE$4:$EU$216,Translating_products!CM71,FALSE))","v":229},277.08999999999997,0,"Stück-Auswahl","Sonstiges",null,null,null,null,null,"nix",null,{"$f":"$Q$7","v":"Kč"},"R"]
[null,{"$f":"Calculation!C82","v":0},{"$f":"HLOOKUP(Main!$C$2,Translating_products!$CN$4:$DD$216,Translating_products!CM72, FALSE)","v":200042},{"$f":"HLOOKUP(Main!$C$2,Translating_products!$DI$4:$DY$216,Translating_products!CM72, FALSE)","v":"5m RGB LED pásky IP20 (bez ochrany proti vodě)"},{"$f":"IF(ISBLANK($Q$1),HLOOKUP(Main!$C$2,Translating_products!$EE$4:$EU$216,Translating_products!CM72,FALSE),HLOOKUP($Q$1,Translating_products!$EE$4:$EU$216,Translating_products!CM72,FALSE))","v":2149},2600.29,0,"Stück-Auswahl Licht","Licht",null,null,null,null,null,{"$f":"14.4*5*B73","v":0},null,"Kč","L"]
[null,{"$f":"Calculation!C83","v":0},{"$f":"HLOOKUP(Main!$C$2,Translating_products!$CN$4:$DD$216,Translating_products!CM73, FALSE)","v":200043},{"$f":"HLOOKUP(Main!$C$2,Translating_products!$DI$4:$DY$216,Translating_products!CM73, FALSE)","v":"5m LED pásky (teplá bílá) - IP20 (bez ochrany proti vodě)"},{"$f":"IF(ISBLANK($Q$1),HLOOKUP(Main!$C$2,Translating_products!$EE$4:$EU$216,Translating_products!CM73,FALSE),HLOOKUP($Q$1,Translating_products!$EE$4:$EU$216,Translating_products!CM73,FALSE))","v":2149},2600.29,0,"Stück-Auswahl Licht","Licht",null,null,null,null,null,{"$f":"14.4*5*B74","v":0},null,"Kč","L"]
[null,{"$f":"Calculation!C85","v":0},{"$f":"HLOOKUP(Main!$C$2,Translating_products!$CN$4:$DD$216,Translating_products!CM75, FALSE)","v":200046},{"$f":"HLOOKUP(Main!$C$2,Translating_products!$DI$4:$DY$216,Translating_products!CM75, FALSE)","v":"5m RGB LED pásky IP68 (proti potopení do vody)"},{"$f":"IF(ISBLANK($Q$1),HLOOKUP(Main!$C$2,Translating_products!$EE$4:$EU$216,Translating_products!CM75,FALSE),HLOOKUP($Q$1,Translating_products!$EE$4:$EU$216,Translating_products!CM75,FALSE))","v":2499},3023.79,0,"Stück-Auswahl Licht","Licht",null,null,null,null,null,{"$f":"14.4*5*B75","v":0},null,"Kč","L"]
[null,{"$f":"Calculation!C238","v":0},{"$f":"HLOOKUP(Main!$C$2,Translating_products!$CN$4:$DD$216,Translating_products!CM76, FALSE)","v":200048},{"$f":"HLOOKUP(Main!$C$2,Translating_products!$DI$4:$DY$216,Translating_products!CM76, FALSE)","v":"SMA anténa 868 MHz"},{"$f":"IF(ISBLANK($Q$1),HLOOKUP(Main!$C$2,Translating_products!$EE$4:$EU$216,Translating_products!CM76,FALSE),HLOOKUP($Q$1,Translating_products!$EE$4:$EU$216,Translating_products!CM76,FALSE))","v":371.9},449.99899999999997,{"$f":"B76*F76","v":0},"Stück-Auswahl","Air",null,null,null,null,null,"nix",null,"Kč","R"]
[null,{"$f":"Calculation!C310+Calculation!C223","v":0},{"$f":"HLOOKUP(Main!$C$2,Translating_products!$CN$4:$DD$216,Translating_products!CM77, FALSE)","v":200049},{"$f":"HLOOKUP(Main!$C$2,Translating_products!$DI$4:$DY$216,Translating_products!CM77, FALSE)","v":"Spojovací relé"},{"$f":"IF(ISBLANK($Q$1),HLOOKUP(Main!$C$2,Translating_products!$EE$4:$EU$216,Translating_products!CM77,FALSE),HLOOKUP($Q$1,Translating_products!$EE$4:$EU$216,Translating_products!CM77,FALSE))","v":396.69},479.99489999999997,0,"Stück-Auswahl","Sonstiges",null,null,null,null,null,"nix",null,"Kč","R"]
[null,{"$f":"Calculation!C337","v":0},{"$f":"HLOOKUP(Main!$C$2,Translating_products!$CN$4:$DD$216,Translating_products!CM78, FALSE)","v":200050},{"$f":"HLOOKUP(Main!$C$2,Translating_products!$DI$4:$DY$216,Translating_products!CM78, FALSE)","v":"Loxone samolepky"},{"$f":"IF(ISBLANK($Q$1),HLOOKUP(Main!$C$2,Translating_products!$EE$4:$EU$216,Translating_products!CM78,FALSE),HLOOKUP($Q$1,Translating_products!$EE$4:$EU$216,Translating_products!CM78,FALSE))","v":73.55},88.995499999999993,0,"Stück-Auswahl Sonstiges","Sonstiges",null,null,null,null,null,"nix",null,"Kč","R"]
[null,{"$f":"Calculation!C180","v":0},{"$f":"HLOOKUP(Main!$C$2,Translating_products!$CN$4:$DD$216,Translating_products!CM79, FALSE)","v":200054},{"$f":"HLOOKUP(Main!$C$2,Translating_products!$DI$4:$DY$216,Translating_products!CM79, FALSE)","v":"Ultrazvukový senzor 0-10V"},{"$f":"IF(ISBLANK($Q$1),HLOOKUP(Main!$C$2,Translating_products!$EE$4:$EU$216,Translating_products!CM79,FALSE),HLOOKUP($Q$1,Translating_products!$EE$4:$EU$216,Translating_products!CM79,FALSE))","v":5247.11},6349.003099999999,0,null,"Sensoren",1,null,null,null,null,{"$f":"B79*0.06","v":0},null,"Kč","R"]
[null,{"$f":"Calculation!C378","v":0},{"$f":"HLOOKUP(Main!$C$2,Translating_products!$CN$4:$DD$216,Translating_products!CM80, FALSE)","v":200057},{"$f":"IF(ISBLANK(Q1),HLOOKUP(Main!$C$2,Translating_products!$DI$4:$DY$216,Translating_products!CM80,FALSE),\"Not available in this country\")","v":"Enocean Bezdrátové tlačítko"},{"$f":"IF(ISBLANK($Q$1),HLOOKUP(Main!$C$2,Translating_products!$EE$4:$EU$216,Translating_products!CM80,FALSE),HLOOKUP($Q$1,Translating_products!$EE$4:$EU$216,Translating_products!CM80,FALSE))","v":1249},1511.29,0,"enocean - extension 1 kanal","Taster",null,null,null,null,1,"nix",null,"Kč","R"]
[null,{"$f":"Calculation!C239","v":0},{"$f":"HLOOKUP(Main!$C$2,Translating_products!$CN$4:$DD$216,Translating_products!CM81, FALSE)","v":200059},{"$f":"IF(ISBLANK(Q1),HLOOKUP(Main!$C$2,Translating_products!$DI$4:$DY$216,Translating_products!CM81,FALSE),\"Not available in this country\")","v":"Enocean Bezdrátový okenní kontakt"},{"$f":"IF(ISBLANK($Q$1),HLOOKUP(Main!$C$2,Translating_products!$EE$4:$EU$216,Translating_products!CM81,FALSE),HLOOKUP($Q$1,Translating_products!$EE$4:$EU$216,Translating_products!CM81,FALSE))","v":2149},2600.29,0,"Stück-Auswahl","Air",null,null,null,null,1,"nix",null,"Kč","R"]
[null,{"$f":"Calculation!C86","v":0},{"$f":"HLOOKUP(Main!$C$2,Translating_products!$CN$4:$DD$216,Translating_products!CM82, FALSE)","v":200061},{"$f":"HLOOKUP(Main!$C$2,Translating_products!$DI$4:$DY$216,Translating_products!CM82, FALSE)","v":"5m LED pásky (teplá bílá) - IP65 (proti tryskající vodě)"},{"$f":"IF(ISBLANK($Q$1),HLOOKUP(Main!$C$2,Translating_products!$EE$4:$EU$216,Translating_products!CM82,FALSE),HLOOKUP($Q$1,Translating_products!$EE$4:$EU$216,Translating_products!CM82,FALSE))","v":2299},2781.79,0,"Stück-Auswahl","Licht",null,null,null,null,null,{"$f":"14.4*5*B82","v":0},null,"Kč","L"]
[null,{"$f":"Calculation!C153","v":0},{"$f":"HLOOKUP(Main!$C$2,Translating_products!$CN$4:$DD$216,Translating_products!CM83, FALSE)","v":200063},{"$f":"HLOOKUP(Main!$C$2,Translating_products!$DI$4:$DY$216,Translating_products!CM83, FALSE)","v":"Čtečka elektronického klíče"},{"$f":"IF(ISBLANK($Q$1),HLOOKUP(Main!$C$2,Translating_products!$EE$4:$EU$216,Translating_products!CM83,FALSE),HLOOKUP($Q$1,Translating_products!$EE$4:$EU$216,Translating_products!CM83,FALSE))","v":230.58},279.0018,0,"belegt 1 kanal von 1 Wire (Temparatur und Zutritt)","Zutritt",null,null,null,null,1,"nix",null,"Kč","R"]
[null,{"$f":"Calculation!C154","v":5},{"$f":"HLOOKUP(Main!$C$2,Translating_products!$CN$4:$DD$216,Translating_products!CM84, FALSE)","v":200064},{"$f":"HLOOKUP(Main!$C$2,Translating_products!$DI$4:$DY$216,Translating_products!CM84, FALSE)","v":"Elektronický klíč"},{"$f":"IF(ISBLANK($Q$1),HLOOKUP(Main!$C$2,Translating_products!$EE$4:$EU$216,Translating_products!CM84,FALSE),HLOOKUP($Q$1,Translating_products!$EE$4:$EU$216,Translating_products!CM84,FALSE))","v":81.819999999999993},99.002199999999988,495.01099999999997,"Stück-Zutritt","Zutritt",null,null,null,null,null,"nix",null,"Kč","R"]
[null,{"$f":"Calculation!C240","v":0},{"$f":"HLOOKUP(Main!$C$2,Translating_products!$CN$4:$DD$216,Translating_products!CM85, FALSE)","v":200067},{"$f":"IF(ISBLANK(Q1),HLOOKUP(Main!$C$2,Translating_products!$DI$4:$DY$216,Translating_products!CM85,FALSE),\"Not available in this country\")","v":"EnOcean bezdrátová hlavice"},{"$f":"IF(ISBLANK($Q$1),HLOOKUP(Main!$C$2,Translating_products!$EE$4:$EU$216,Translating_products!CM85,FALSE),HLOOKUP($Q$1,Translating_products!$EE$4:$EU$216,Translating_products!CM85,FALSE))","v":3799},4596.79,0,"belegt 1 kanal enocean extension","Air",null,null,null,null,1,"nix",null,"Kč","R"]
[null,{"$f":"Calculation!C155","v":0},{"$f":"HLOOKUP(Main!$C$2,Translating_products!$CN$4:$DD$216,Translating_products!CM86, FALSE)","v":200070},{"$f":"HLOOKUP(Main!$C$2,Translating_products!$DI$4:$DY$216,Translating_products!CM86, FALSE)","v":"Elektronický klíč (Magnetický)"},{"$f":"IF(ISBLANK($Q$1),HLOOKUP(Main!$C$2,Translating_products!$EE$4:$EU$216,Translating_products!CM86,FALSE),HLOOKUP($Q$1,Translating_products!$EE$4:$EU$216,Translating_products!CM86,FALSE))","v":205.79},249.0059,0,"Stück-Auswahl Zutritt","Zutritt",null,null,null,null,null,"nix",null,"Kč","R"]
[null,{"$f":"Calculation!C141+Calculation!C181","v":0},{"$f":"HLOOKUP(Main!$C$2,Translating_products!$CN$4:$DD$216,Translating_products!CM87, FALSE)","v":200077},{"$f":"HLOOKUP(Main!$C$2,Translating_products!$DI$4:$DY$216,Translating_products!CM87, FALSE)","v":"1-Wire teplotní čip v pouzdře"},{"$f":"IF(ISBLANK($Q$1),HLOOKUP(Main!$C$2,Translating_products!$EE$4:$EU$216,Translating_products!CM87,FALSE),HLOOKUP($Q$1,Translating_products!$EE$4:$EU$216,Translating_products!CM87,FALSE))","v":285.39999999999998},345.33399999999995,0,"1-Wire Extension 1 Kanal","Sensoren",null,null,null,null,1,"nix",null,"Kč","R"]
[null,{"$f":"Calculation!C338","v":0},{"$f":"HLOOKUP(Main!$C$2,Translating_products!$CN$4:$DD$216,Translating_products!CM88, FALSE)","v":200086},{"$f":"HLOOKUP(Main!$C$2,Translating_products!$DI$4:$DY$216,Translating_products!CM88, FALSE)","v":"Loxone Fanshirt S"},{"$f":"IF(ISBLANK($Q$1),HLOOKUP(Main!$C$2,Translating_products!$EE$4:$EU$216,Translating_products!CM88,FALSE),HLOOKUP($Q$1,Translating_products!$EE$4:$EU$216,Translating_products!CM88,FALSE))","v":285.39999999999998},345.33399999999995,0,"Stück-Auswahl Sonstiges","Sonstiges",null,null,null,null,null,"nix",null,"Kč","R"]
[null,{"$f":"Calculation!C339","v":0},{"$f":"HLOOKUP(Main!$C$2,Translating_products!$CN$4:$DD$216,Translating_products!CM89, FALSE)","v":200087},{"$f":"HLOOKUP(Main!$C$2,Translating_products!$DI$4:$DY$216,Translating_products!CM89, FALSE)","v":"Loxone Fanshirt M"},{"$f":"IF(ISBLANK($Q$1),HLOOKUP(Main!$C$2,Translating_products!$EE$4:$EU$216,Translating_products!CM89,FALSE),HLOOKUP($Q$1,Translating_products!$EE$4:$EU$216,Translating_products!CM89,FALSE))","v":319},385.99,0,"Stück-Auswahl Sonstiges","Sonstiges",null,null,null,null,null,"nix",null,"Kč","R"]
[null,{"$f":"Calculation!C340","v":0},{"$f":"HLOOKUP(Main!$C$2,Translating_products!$CN$4:$DD$216,Translating_products!CM90, FALSE)","v":200088},{"$f":"HLOOKUP(Main!$C$2,Translating_products!$DI$4:$DY$216,Translating_products!CM90, FALSE)","v":"Loxone Fanshirt L"},{"$f":"IF(ISBLANK($Q$1),HLOOKUP(Main!$C$2,Translating_products!$EE$4:$EU$216,Translating_products!CM90,FALSE),HLOOKUP($Q$1,Translating_products!$EE$4:$EU$216,Translating_products!CM90,FALSE))","v":319},385.99,0,"Stück-Auswahl Sonstiges","Sonstiges",null,null,null,null,null,"nix",null,"Kč","R"]
[null,{"$f":"Calculation!C341","v":0},{"$f":"HLOOKUP(Main!$C$2,Translating_products!$CN$4:$DD$216,Translating_products!CM91, FALSE)","v":200089},{"$f":"HLOOKUP(Main!$C$2,Translating_products!$DI$4:$DY$216,Translating_products!CM91, FALSE)","v":"Loxone Fanshirt XL"},{"$f":"IF(ISBLANK($Q$1),HLOOKUP(Main!$C$2,Translating_products!$EE$4:$EU$216,Translating_products!CM91,FALSE),HLOOKUP($Q$1,Translating_products!$EE$4:$EU$216,Translating_products!CM91,FALSE))","v":319},385.99,0,"Stück-Auswahl Sonstiges","Sonstiges",null,null,null,null,null,"nix",null,"Kč","R"]
[null,{"$f":"Calculation!C342","v":0},{"$f":"HLOOKUP(Main!$C$2,Translating_products!$CN$4:$DD$216,Translating_products!CM92, FALSE)","v":200090},{"$f":"HLOOKUP(Main!$C$2,Translating_products!$DI$4:$DY$216,Translating_products!CM92, FALSE)","v":"Loxone Fanshirt XXL"},{"$f":"IF(ISBLANK($Q$1),HLOOKUP(Main!$C$2,Translating_products!$EE$4:$EU$216,Translating_products!CM92,FALSE),HLOOKUP($Q$1,Translating_products!$EE$4:$EU$216,Translating_products!CM92,FALSE))","v":319},385.99,0,"Stück-Auswahl Sonstiges","Sonstiges",null,null,null,null,null,"nix",null,"Kč","R"]
[null,{"$f":"Calculation!C87","v":0},{"$f":"HLOOKUP(Main!$C$2,Translating_products!$CN$4:$DD$216,Translating_products!CM93, FALSE)","v":200092},{"$f":"HLOOKUP(Main!$C$2,Translating_products!$DI$4:$DY$216,Translating_products!CM93, FALSE)","v":"5m LED pásky (teplá bílá) - IP68 (proti potopení do vody)"},{"$f":"IF(ISBLANK($Q$1),HLOOKUP(Main!$C$2,Translating_products!$EE$4:$EU$216,Translating_products!CM93,FALSE),HLOOKUP($Q$1,Translating_products!$EE$4:$EU$216,Translating_products!CM93,FALSE))","v":2499},3023.79,0,"Stück-Auswahl","Licht",null,null,null,null,null,{"$f":"14.4*5*B93","v":0},null,"Kč","L"]
[null,{"$f":"Calculation!C158","v":0},{"$f":"HLOOKUP(Main!$C$2,Translating_products!$CN$4:$DD$216,Translating_products!CM94, FALSE)","v":200093},{"$f":"HLOOKUP(Main!$C$2,Translating_products!$DI$4:$DY$216,Translating_products!CM94, FALSE)","v":"Loxone Intercom"},{"$f":"IF(ISBLANK($Q$1),HLOOKUP(Main!$C$2,Translating_products!$EE$4:$EU$216,Translating_products!CM94,FALSE),HLOOKUP($Q$1,Translating_products!$EE$4:$EU$216,Translating_products!CM94,FALSE))","v":24999},30248.79,0,"Stück-Auswähl Zutritt","Zutritt",null,null,null,null,null,"nix",null,"Kč","R"]
[null,{"$f":"Calculation!C159","v":1},{"$f":"HLOOKUP(Main!$C$2,Translating_products!$CN$4:$DD$216,Translating_products!CM95, FALSE)","v":200094},{"$f":"HLOOKUP(Main!$C$2,Translating_products!$DI$4:$DY$216,Translating_products!CM95, FALSE)","v":"Zapuštěný box pro Loxone Intercom"},{"$f":"IF(ISBLANK($Q$1),HLOOKUP(Main!$C$2,Translating_products!$EE$4:$EU$216,Translating_products!CM95,FALSE),HLOOKUP($Q$1,Translating_products!$EE$4:$EU$216,Translating_products!CM95,FALSE))","v":1375},1663.75,1663.75,"Stück-Auswähl Zutritt","Zutritt",null,null,null,null,null,"nix",null,"Kč","R"]
[null,{"$f":"Calculation!C160","v":0},{"$f":"HLOOKUP(Main!$C$2,Translating_products!$CN$4:$DD$216,Translating_products!CM96, FALSE)","v":200095},{"$f":"HLOOKUP(Main!$C$2,Translating_products!$DI$4:$DY$216,Translating_products!CM96, FALSE)","v":"Povrchový box pro Loxone Intercom"},{"$f":"IF(ISBLANK($Q$1),HLOOKUP(Main!$C$2,Translating_products!$EE$4:$EU$216,Translating_products!CM96,FALSE),HLOOKUP($Q$1,Translating_products!$EE$4:$EU$216,Translating_products!CM96,FALSE))","v":2499},3023.79,0,"Stück-Auswähl Zutritt","Zutritt",null,null,null,null,null,"nix",null,"Kč","R"]
[null,{"$f":"Calculation!C125","v":5},{"$f":"HLOOKUP(Main!$C$2,Translating_products!$CN$4:$DD$216,Translating_products!CM97, FALSE)","v":200097},{"$f":"HLOOKUP(Main!$C$2,Translating_products!$DI$4:$DY$216,Translating_products!CM97, FALSE)","v":"Loxone Speaker"},{"$f":"IF(ISBLANK($Q$1),HLOOKUP(Main!$C$2,Translating_products!$EE$4:$EU$216,Translating_products!CM97,FALSE),HLOOKUP($Q$1,Translating_products!$EE$4:$EU$216,Translating_products!CM97,FALSE))","v":2225},2692.25,13461.25,"Stück-Auswahl Musik (1 Kanal am Musikserver)","Musik",null,null,null,null,1,"nix",null,"Kč","R"]
[null,{"$f":"Calculation!C88","v":4},{"$f":"HLOOKUP(Main!$C$2,Translating_products!$CN$4:$DD$216,Translating_products!CM98, FALSE)","v":200098},{"$f":"HLOOKUP(Main!$C$2,Translating_products!$DI$4:$DY$216,Translating_products!CM98, FALSE)","v":"5m RGBW LED pásky IP20 (bez ochrany proti vodě)"},{"$f":"IF(ISBLANK($Q$1),HLOOKUP(Main!$C$2,Translating_products!$EE$4:$EU$216,Translating_products!CM98,FALSE),HLOOKUP($Q$1,Translating_products!$EE$4:$EU$216,Translating_products!CM98,FALSE))","v":2999},3628.79,14515.16,"Stück-Auswahl Licht","Licht",null,null,null,null,null,{"$f":"B98*4.2","v":16.8},null,"Kč","L"]
[null,{"$f":"Calculation!C89","v":0},{"$f":"HLOOKUP(Main!$C$2,Translating_products!$CN$4:$DD$216,Translating_products!CM99, FALSE)","v":200099},{"$f":"HLOOKUP(Main!$C$2,Translating_products!$DI$4:$DY$216,Translating_products!CM99, FALSE)","v":"5m RGBW LED pásky IP65 (proti tryskající vodě)"},{"$f":"IF(ISBLANK($Q$1),HLOOKUP(Main!$C$2,Translating_products!$EE$4:$EU$216,Translating_products!CM99,FALSE),HLOOKUP($Q$1,Translating_products!$EE$4:$EU$216,Translating_products!CM99,FALSE))","v":3099},3749.79,0,"Stück-Auswahl Licht","Licht",null,null,null,null,null,{"$f":"B99*4.2","v":0},null,"Kč","L"]
[null,{"$f":"Calculation!C90","v":0},{"$f":"HLOOKUP(Main!$C$2,Translating_products!$CN$4:$DD$216,Translating_products!CM100, FALSE)","v":200100},{"$f":"HLOOKUP(Main!$C$2,Translating_products!$DI$4:$DY$216,Translating_products!CM100, FALSE)","v":"5m RGBW LED pásky IP68 (proti potopení do vody)"},{"$f":"IF(ISBLANK($Q$1),HLOOKUP(Main!$C$2,Translating_products!$EE$4:$EU$216,Translating_products!CM100,FALSE),HLOOKUP($Q$1,Translating_products!$EE$4:$EU$216,Translating_products!CM100,FALSE))","v":3249},3931.29,0,"Stück-Auswahl Licht","Licht",null,null,null,null,null,0,null,"Kč","L"]
[null,{"$f":"Calculation!C182","v":0},{"$f":"HLOOKUP(Main!$C$2,Translating_products!$CN$4:$DD$216,Translating_products!CM101, FALSE)","v":200101},{"$f":"HLOOKUP(Main!$C$2,Translating_products!$DI$4:$DY$216,Translating_products!CM101, FALSE)","v":"Záplavový senzor"},{"$f":"IF(ISBLANK($Q$1),HLOOKUP(Main!$C$2,Translating_products!$EE$4:$EU$216,Translating_products!CM101,FALSE),HLOOKUP($Q$1,Translating_products!$EE$4:$EU$216,Translating_products!CM101,FALSE))","v":425},514.25,0,"Sensoren","Sensoren",null,1,null,null,null,"nix",null,"Kč","R"]
[null,{"$f":"Calculation!C311","v":0},{"$f":"HLOOKUP(Main!$C$2,Translating_products!$CN$4:$DD$216,Translating_products!CM102, FALSE)","v":"not available in this country"},{"$f":"IF(ISBLANK(Q1),HLOOKUP(Main!$C$2,Translating_products!$DI$4:$DY$216,Translating_products!CM102,FALSE),\"Not available in this country\")","v":"not available in this country"},{"$f":"IF(ISBLANK($Q$1),HLOOKUP(Main!$C$2,Translating_products!$EE$4:$EU$216,Translating_products!CM102,FALSE),HLOOKUP($Q$1,Translating_products!$EE$4:$EU$216,Translating_products!CM102,FALSE))","v":0},0,0,"Stück-Auswahl","Sonstiges",null,null,null,null,null,"nix",null,"Kč","R"]
[null,{"$f":"Calculation!C142+Calculation!C183","v":0},{"$f":"HLOOKUP(Main!$C$2,Translating_products!$CN$4:$DD$216,Translating_products!CM103, FALSE)","v":200109},{"$f":"HLOOKUP(Main!$C$2,Translating_products!$DI$4:$DY$216,Translating_products!CM103, FALSE)","v":"1-Wire teplotní senzor set"},{"$f":"IF(ISBLANK($Q$1),HLOOKUP(Main!$C$2,Translating_products!$EE$4:$EU$216,Translating_products!CM103,FALSE),HLOOKUP($Q$1,Translating_products!$EE$4:$EU$216,Translating_products!CM103,FALSE))","v":1049},{"$f":"E103*(1+$E$197*0.01)","v":1269.29},0,"5 Temparaturfühler (11 in der Auswahl = 3 mal Paket (15))","Heizung",null,null,null,null,5,"nix",null,"Kč","H"]
[null,{"$f":"Calculation!C126","v":1},{"$f":"HLOOKUP(Main!$C$2,Translating_products!$CN$4:$DD$216,Translating_products!CM104, FALSE)","v":200110},{"$f":"HLOOKUP(Main!$C$2,Translating_products!$DI$4:$DY$216,Translating_products!CM104, FALSE)","v":"Loxone 12ti kanálový zesilovač"},{"$f":"IF(ISBLANK($Q$1),HLOOKUP(Main!$C$2,Translating_products!$EE$4:$EU$216,Translating_products!CM104,FALSE),HLOOKUP($Q$1,Translating_products!$EE$4:$EU$216,Translating_products!CM104,FALSE))","v":15999},19358.79,19358.79,"Stück-Auswahl Musik","Musik",null,null,null,null,null,"nix",null,"Kč","M"]
[null,{"$f":"Calculation!C184","v":2},{"$f":"HLOOKUP(Main!$C$2,Translating_products!$CN$4:$DD$216,Translating_products!CM105, FALSE)","v":200112},{"$f":"HLOOKUP(Main!$C$2,Translating_products!$DI$4:$DY$216,Translating_products!CM105, FALSE)","v":"Senzor pohybu 24V (venkovní)"},{"$f":"IF(ISBLANK($Q$1),HLOOKUP(Main!$C$2,Translating_products!$EE$4:$EU$216,Translating_products!CM105,FALSE),HLOOKUP($Q$1,Translating_products!$EE$4:$EU$216,Translating_products!CM105,FALSE))","v":2499},3023.79,6047.58,null,"Sensoren",null,1,null,null,null,{"$f":"B105*0.0033","v":6.6E-3},null,"Kč","R"]
[null,{"$f":"Calculation!C186","v":0},{"$f":"HLOOKUP(Main!$C$2,Translating_products!$CN$4:$DD$216,Translating_products!CM106, FALSE)","v":200113},{"$f":"HLOOKUP(Main!$C$2,Translating_products!$DI$4:$DY$216,Translating_products!CM106, FALSE)","v":"Okenní kontakt"},{"$f":"IF(ISBLANK($Q$1),HLOOKUP(Main!$C$2,Translating_products!$EE$4:$EU$216,Translating_products!CM106,FALSE),HLOOKUP($Q$1,Translating_products!$EE$4:$EU$216,Translating_products!CM106,FALSE))","v":259},313.39,0,null,"Sensoren",null,1,null,null,null,"nix",null,"Kč","R"]
[null,{"$f":"Calculation!C220","v":0},{"$f":"HLOOKUP(Main!$C$2,Translating_products!$CN$4:$DD$216,Translating_products!CM107, FALSE)","v":200129},{"$f":"HLOOKUP(Main!$C$2,Translating_products!$DI$4:$DY$216,Translating_products!CM107, FALSE)","v":"Loxone Cat 7 kabel"},{"$f":"IF(ISBLANK($Q$1),HLOOKUP(Main!$C$2,Translating_products!$EE$4:$EU$216,Translating_products!CM107,FALSE),HLOOKUP($Q$1,Translating_products!$EE$4:$EU$216,Translating_products!CM107,FALSE))","v":4699},5685.79,0,"Stück-Auswahl","Sonstiges",null,null,null,null,null,"nix",null,"Kč","R"]
[null,{"$f":"Calculation!C241","v":0},{"$f":"HLOOKUP(Main!$C$2,Translating_products!$CN$4:$DD$216,Translating_products!CM108, FALSE)","v":200135},{"$f":"HLOOKUP(Main!$C$2,Translating_products!$DI$4:$DY$216,Translating_products!CM108, FALSE)","v":"Enocean Bezdrátový pohybový senzor"},{"$f":"IF(ISBLANK($Q$1),HLOOKUP(Main!$C$2,Translating_products!$EE$4:$EU$216,Translating_products!CM108,FALSE),HLOOKUP($Q$1,Translating_products!$EE$4:$EU$216,Translating_products!CM108,FALSE))","v":4049},4899.29,0,"enocean - extension 1 kanal (für Licht und Temparatur)","Air",null,null,null,null,1,"nix",null,"Kč","R"]
[null,{"$f":"Calculation!C187","v":0},{"$f":"HLOOKUP(Main!$C$2,Translating_products!$CN$4:$DD$216,Translating_products!CM109, FALSE)","v":200136},{"$f":"HLOOKUP(Main!$C$2,Translating_products!$DI$4:$DY$216,Translating_products!CM109, FALSE)","v":"Saunový senzor teplota/vlhkost"},{"$f":"IF(ISBLANK($Q$1),HLOOKUP(Main!$C$2,Translating_products!$EE$4:$EU$216,Translating_products!CM109,FALSE),HLOOKUP($Q$1,Translating_products!$EE$4:$EU$216,Translating_products!CM109,FALSE))","v":3999},4838.79,0,null,"Sonstiges",2,null,null,null,null,{"$f":"0.01*B109","v":0},null,"Kč","R"]
[null,{"$f":"Calculation!C242","v":0},{"$f":"HLOOKUP(Main!$C$2,Translating_products!$CN$4:$DD$216,Translating_products!CM110, FALSE)","v":200137},{"$f":"HLOOKUP(Main!$C$2,Translating_products!$DI$4:$DY$216,Translating_products!CM110, FALSE)","v":"EnOcean bezdrátový aktor"},{"$f":"IF(ISBLANK($Q$1),HLOOKUP(Main!$C$2,Translating_products!$EE$4:$EU$216,Translating_products!CM110,FALSE),HLOOKUP($Q$1,Translating_products!$EE$4:$EU$216,Translating_products!CM110,FALSE))","v":1999},2418.79,0,"enocean - extension 1 kanal (für Licht und Temparatur)","Air",null,null,null,null,1,"nix",null,"Kč","R"]
[null,{"$f":"Calculation!C312+Calculation!L416","v":0},{"$f":"HLOOKUP(Main!$C$2,Translating_products!$CN$4:$DD$216,Translating_products!CM111, FALSE)","v":200143},{"$f":"HLOOKUP(Main!$C$2,Translating_products!$DI$4:$DY$216,Translating_products!CM111, FALSE)","v":"Zdroj 24V, 0,4A"},{"$f":"IF(ISBLANK($Q$1),HLOOKUP(Main!$C$2,Translating_products!$EE$4:$EU$216,Translating_products!CM111,FALSE),HLOOKUP($Q$1,Translating_products!$EE$4:$EU$216,Translating_products!CM111,FALSE))","v":749},906.29,0,"Stück-Auswahl","Sonstiges",null,null,null,null,null,"nix",null,"Kč","R"]
[null,{"$f":"Calculation!C127","v":0},{"$f":"HLOOKUP(Main!$C$2,Translating_products!$CN$4:$DD$216,Translating_products!CM112, FALSE)","v":200150},{"$f":"HLOOKUP(Main!$C$2,Translating_products!$DI$4:$DY$216,Translating_products!CM112, FALSE)","v":"Instalační box pro Loxone reproduktor (speaker)"},{"$f":"IF(ISBLANK($Q$1),HLOOKUP(Main!$C$2,Translating_products!$EE$4:$EU$216,Translating_products!CM112,FALSE),HLOOKUP($Q$1,Translating_products!$EE$4:$EU$216,Translating_products!CM112,FALSE))","v":1199},1450.79,0,"Stück-Auswahl Musik (wählt Kunde aus)","Musik",null,null,null,null,null,"nix",null,"Kč","M"]
[null,{"$f":"Calculation!C243","v":0},{"$f":"HLOOKUP(Main!$C$2,Translating_products!$CN$4:$DD$216,Translating_products!CM113, FALSE)","v":200151},{"$f":"HLOOKUP(Main!$C$2,Translating_products!$DI$4:$DY$216,Translating_products!CM113, FALSE)","v":"SMA Anténa 4dBi 868 MHz"},{"$f":"IF(ISBLANK($Q$1),HLOOKUP(Main!$C$2,Translating_products!$EE$4:$EU$216,Translating_products!CM113,FALSE),HLOOKUP($Q$1,Translating_products!$EE$4:$EU$216,Translating_products!CM113,FALSE))","v":579},700.59,0,"Stück-Auswahl Air","Air",null,null,null,null,null,"nix",null,"Kč","R"]
[null,{"$f":"Calculation!C130","v":0},{"$f":"HLOOKUP(Main!$C$2,Translating_products!$CN$4:$DD$216,Translating_products!CM114, FALSE)","v":200153},{"$f":"HLOOKUP(Main!$C$2,Translating_products!$DI$4:$DY$216,Translating_products!CM114, FALSE)","v":"Loxone Wall Speaker"},{"$f":"IF(ISBLANK($Q$1),HLOOKUP(Main!$C$2,Translating_products!$EE$4:$EU$216,Translating_products!CM114,FALSE),HLOOKUP($Q$1,Translating_products!$EE$4:$EU$216,Translating_products!CM114,FALSE))","v":3099},3749.79,0,"Stück-Auswahl Musik","Musik",null,null,null,null,null,"nix",null,"Kč","M"]
[null,{"$f":"Calculation!C188","v":0},{"$f":"HLOOKUP(Main!$C$2,Translating_products!$CN$4:$DD$216,Translating_products!CM115, FALSE)","v":200154},{"$f":"HLOOKUP(Main!$C$2,Translating_products!$DI$4:$DY$216,Translating_products!CM115, FALSE)","v":"Senzor tlaku 0-10V"},{"$f":"IF(ISBLANK($Q$1),HLOOKUP(Main!$C$2,Translating_products!$EE$4:$EU$216,Translating_products!CM115,FALSE),HLOOKUP($Q$1,Translating_products!$EE$4:$EU$216,Translating_products!CM115,FALSE))","v":2849},3447.29,0,null,"Sensoren",1,null,null,null,null,{"$f":"B115*0.01","v":0},null,"Kč","R"]
[null,{"$f":"Calculation!C189","v":0},{"$f":"HLOOKUP(Main!$C$2,Translating_products!$CN$4:$DD$216,Translating_products!CM116, FALSE)","v":200155},{"$f":"HLOOKUP(Main!$C$2,Translating_products!$DI$4:$DY$216,Translating_products!CM116, FALSE)","v":"Senzor rozbití okna 24V"},{"$f":"IF(ISBLANK($Q$1),HLOOKUP(Main!$C$2,Translating_products!$EE$4:$EU$216,Translating_products!CM116,FALSE),HLOOKUP($Q$1,Translating_products!$EE$4:$EU$216,Translating_products!CM116,FALSE))","v":699},845.79,0,null,"Sensoren",null,1,null,null,null,"nix",null,"Kč","R"]
[null,{"$f":"Calculation!C313","v":0},{"$f":"HLOOKUP(Main!$C$2,Translating_products!$CN$4:$DD$216,Translating_products!CM117, FALSE)","v":200156},{"$f":"HLOOKUP(Main!$C$2,Translating_products!$DI$4:$DY$216,Translating_products!CM117, FALSE)","v":"1-fázový elektroměr (Modbus)"},{"$f":"IF(ISBLANK($Q$1),HLOOKUP(Main!$C$2,Translating_products!$EE$4:$EU$216,Translating_products!CM117,FALSE),HLOOKUP($Q$1,Translating_products!$EE$4:$EU$216,Translating_products!CM117,FALSE))","v":3799},4596.79,0,"selbst auswählen","Sonstiges",null,null,null,null,null,"nix",null,"Kč","R"]
[null,{"$f":"Calculation!C314","v":0},{"$f":"HLOOKUP(Main!$C$2,Translating_products!$CN$4:$DD$216,Translating_products!CM118, FALSE)","v":200157},{"$f":"HLOOKUP(Main!$C$2,Translating_products!$DI$4:$DY$216,Translating_products!CM118, FALSE)","v":"3-fázový elektroměr (Modbus)"},{"$f":"IF(ISBLANK($Q$1),HLOOKUP(Main!$C$2,Translating_products!$EE$4:$EU$216,Translating_products!CM118,FALSE),HLOOKUP($Q$1,Translating_products!$EE$4:$EU$216,Translating_products!CM118,FALSE))","v":6799},8226.7899999999991,0,"selbst auswählen","Sonstiges",null,null,null,null,null,"nix",null,"Kč","R"]
[null,{"$f":"Calculation!C343","v":0},{"$f":"HLOOKUP(Main!$C$2,Translating_products!$CN$4:$DD$216,Translating_products!CM119, FALSE)","v":"not available in this country"},{"$f":"HLOOKUP(Main!$C$2,Translating_products!$DI$4:$DY$216,Translating_products!CM119, FALSE)","v":"not available in this country"},{"$f":"IF(ISBLANK($Q$1),HLOOKUP(Main!$C$2,Translating_products!$EE$4:$EU$216,Translating_products!CM119,FALSE),HLOOKUP($Q$1,Translating_products!$EE$4:$EU$216,Translating_products!CM119,FALSE))","v":0},0,0,"buggy im shop","Sonstiges",null,null,null,null,null,"nix",null,"Kč","R"]
[null,{"$f":"Calculation!C204","v":0},{"$f":"HLOOKUP(Main!$C$2,Translating_products!$CN$4:$DD$216,Translating_products!CM120, FALSE)","v":200168},{"$f":"HLOOKUP(Main!$C$2,Translating_products!$DI$4:$DY$216,Translating_products!CM120, FALSE)","v":"Svorka na DIN lištu PPV8 (20 kusů)"},{"$f":"IF(ISBLANK($Q$1),HLOOKUP(Main!$C$2,Translating_products!$EE$4:$EU$216,Translating_products!CM120,FALSE),HLOOKUP($Q$1,Translating_products!$EE$4:$EU$216,Translating_products!CM120,FALSE))","v":5499},6653.79,0,"Stück-Auswahl Verteiler","Verteiler",null,null,null,null,null,"nix",null,"Kč","R"]
[null,{"$f":"Calculation!C205","v":0},{"$f":"HLOOKUP(Main!$C$2,Translating_products!$CN$4:$DD$216,Translating_products!CM121, FALSE)","v":200169},{"$f":"HLOOKUP(Main!$C$2,Translating_products!$DI$4:$DY$216,Translating_products!CM121, FALSE)","v":"Propojovací rozvaděč PRV8 (20 kusů)"},{"$f":"IF(ISBLANK($Q$1),HLOOKUP(Main!$C$2,Translating_products!$EE$4:$EU$216,Translating_products!CM121,FALSE),HLOOKUP($Q$1,Translating_products!$EE$4:$EU$216,Translating_products!CM121,FALSE))","v":5199},6290.79,0,"Stück-Auswahl Verteiler","Verteiler",null,null,null,null,null,"nix",null,"Kč","R"]
[null,{"$f":"Calculation!C206","v":0},{"$f":"HLOOKUP(Main!$C$2,Translating_products!$CN$4:$DD$216,Translating_products!CM122, FALSE)","v":200170},{"$f":"HLOOKUP(Main!$C$2,Translating_products!$DI$4:$DY$216,Translating_products!CM122, FALSE)","v":"Předělovací deska PRV8 (10 kusů)"},{"$f":"IF(ISBLANK($Q$1),HLOOKUP(Main!$C$2,Translating_products!$EE$4:$EU$216,Translating_products!CM122,FALSE),HLOOKUP($Q$1,Translating_products!$EE$4:$EU$216,Translating_products!CM122,FALSE))","v":299},361.78999999999996,0,"Stück-Auswahl Verteiler","Verteiler",null,null,null,null,null,"nix",null,"Kč","R"]
[null,{"$f":"Calculation!C207","v":0},{"$f":"HLOOKUP(Main!$C$2,Translating_products!$CN$4:$DD$216,Translating_products!CM123, FALSE)","v":200171},{"$f":"HLOOKUP(Main!$C$2,Translating_products!$DI$4:$DY$216,Translating_products!CM123, FALSE)","v":"Držák na značky pro PPV8/PRV8 (20 kusů)"},{"$f":"IF(ISBLANK($Q$1),HLOOKUP(Main!$C$2,Translating_products!$EE$4:$EU$216,Translating_products!CM123,FALSE),HLOOKUP($Q$1,Translating_products!$EE$4:$EU$216,Translating_products!CM123,FALSE))","v":699},845.79,0,"Stück-Auswahl Verteiler","Verteiler",null,null,null,null,null,"nix",null,"Kč","R"]
[null,{"$f":"Calculation!C208","v":0},{"$f":"HLOOKUP(Main!$C$2,Translating_products!$CN$4:$DD$216,Translating_products!CM124, FALSE)","v":200172},{"$f":"HLOOKUP(Main!$C$2,Translating_products!$DI$4:$DY$216,Translating_products!CM124, FALSE)","v":"Bočnice pro PPV8/PRV8 (10 kusů)"},{"$f":"IF(ISBLANK($Q$1),HLOOKUP(Main!$C$2,Translating_products!$EE$4:$EU$216,Translating_products!CM124,FALSE),HLOOKUP($Q$1,Translating_products!$EE$4:$EU$216,Translating_products!CM124,FALSE))","v":139},168.19,0,"Stück-Auswahl Verteiler","Verteiler",null,null,null,null,null,"nix",null,"Kč","R"]
[null,{"$f":"Calculation!C209","v":0},{"$f":"HLOOKUP(Main!$C$2,Translating_products!$CN$4:$DD$216,Translating_products!CM125, FALSE)","v":200173},{"$f":"HLOOKUP(Main!$C$2,Translating_products!$DI$4:$DY$216,Translating_products!CM125, FALSE)","v":"Svorka pro připojení motoru PMAK4 (50 kusů)"},{"$f":"IF(ISBLANK($Q$1),HLOOKUP(Main!$C$2,Translating_products!$EE$4:$EU$216,Translating_products!CM125,FALSE),HLOOKUP($Q$1,Translating_products!$EE$4:$EU$216,Translating_products!CM125,FALSE))","v":5299},6411.79,0,"Stück-Auswahl Verteiler","Verteiler",null,null,null,null,null,"nix",null,"Kč","B"]
[null,{"$f":"Calculation!C210","v":0},{"$f":"HLOOKUP(Main!$C$2,Translating_products!$CN$4:$DD$216,Translating_products!CM126, FALSE)","v":200174},{"$f":"HLOOKUP(Main!$C$2,Translating_products!$DI$4:$DY$216,Translating_products!CM126, FALSE)","v":"Bočnice pro PMAK4 (20 kusů)"},{"$f":"IF(ISBLANK($Q$1),HLOOKUP(Main!$C$2,Translating_products!$EE$4:$EU$216,Translating_products!CM126,FALSE),HLOOKUP($Q$1,Translating_products!$EE$4:$EU$216,Translating_products!CM126,FALSE))","v":279},337.59,0,"Stück-Auswahl Verteiler","Verteiler",null,null,null,null,null,"nix",null,"Kč","R"]
[null,{"$f":"Calculation!C211","v":0},{"$f":"HLOOKUP(Main!$C$2,Translating_products!$CN$4:$DD$216,Translating_products!CM127, FALSE)","v":200175},{"$f":"HLOOKUP(Main!$C$2,Translating_products!$DI$4:$DY$216,Translating_products!CM127, FALSE)","v":"Svorkovnice PDL (50 kusů)"},{"$f":"IF(ISBLANK($Q$1),HLOOKUP(Main!$C$2,Translating_products!$EE$4:$EU$216,Translating_products!CM127,FALSE),HLOOKUP($Q$1,Translating_products!$EE$4:$EU$216,Translating_products!CM127,FALSE))","v":2799},3386.79,0,"Stück-Auswahl Verteiler","Verteiler",null,null,null,null,null,"nix",null,"Kč","R"]
[null,{"$f":"Calculation!C212","v":0},{"$f":"HLOOKUP(Main!$C$2,Translating_products!$CN$4:$DD$216,Translating_products!CM128, FALSE)","v":200176},{"$f":"HLOOKUP(Main!$C$2,Translating_products!$DI$4:$DY$216,Translating_products!CM128, FALSE)","v":"Bočnice pro PDL (20 kusů)"},{"$f":"IF(ISBLANK($Q$1),HLOOKUP(Main!$C$2,Translating_products!$EE$4:$EU$216,Translating_products!CM128,FALSE),HLOOKUP($Q$1,Translating_products!$EE$4:$EU$216,Translating_products!CM128,FALSE))","v":199},240.79,0,"Stück-Auswahl Verteiler","Verteiler",null,null,null,null,null,"nix",null,"Kč","R"]
[null,{"$f":"Calculation!C213","v":0},{"$f":"HLOOKUP(Main!$C$2,Translating_products!$CN$4:$DD$216,Translating_products!CM129, FALSE)","v":200177},{"$f":"HLOOKUP(Main!$C$2,Translating_products!$DI$4:$DY$216,Translating_products!CM129, FALSE)","v":"Koncová podpěra svorkovnice ZEW 35 (20 kusů)"},{"$f":"IF(ISBLANK($Q$1),HLOOKUP(Main!$C$2,Translating_products!$EE$4:$EU$216,Translating_products!CM129,FALSE),HLOOKUP($Q$1,Translating_products!$EE$4:$EU$216,Translating_products!CM129,FALSE))","v":199},240.79,0,"Stück-Auswahl Verteiler","Verteiler",null,null,null,null,null,"nix",null,"Kč","R"]
[null,{"$f":"Calculation!C214","v":0},{"$f":"HLOOKUP(Main!$C$2,Translating_products!$CN$4:$DD$216,Translating_products!CM130, FALSE)","v":200178},{"$f":"HLOOKUP(Main!$C$2,Translating_products!$DI$4:$DY$216,Translating_products!CM130, FALSE)","v":"Pojistková svorkovnice (25 kusů)"},{"$f":"IF(ISBLANK($Q$1),HLOOKUP(Main!$C$2,Translating_products!$EE$4:$EU$216,Translating_products!CM130,FALSE),HLOOKUP($Q$1,Translating_products!$EE$4:$EU$216,Translating_products!CM130,FALSE))","v":3399},4112.79,0,"Stück-Auswahl Verteiler","Verteiler",null,null,null,null,null,"nix",null,"Kč","R"]
[null,{"$f":"Calculation!C215","v":0},{"$f":"HLOOKUP(Main!$C$2,Translating_products!$CN$4:$DD$216,Translating_products!CM131, FALSE)","v":200179},{"$f":"HLOOKUP(Main!$C$2,Translating_products!$DI$4:$DY$216,Translating_products!CM131, FALSE)","v":"Bočnice pojistkové svorkovnice (50 kusů)"},{"$f":"IF(ISBLANK($Q$1),HLOOKUP(Main!$C$2,Translating_products!$EE$4:$EU$216,Translating_products!CM131,FALSE),HLOOKUP($Q$1,Translating_products!$EE$4:$EU$216,Translating_products!CM131,FALSE))","v":449},543.29,0,"Stück-Auswahl Verteiler","Verteiler",null,null,null,null,null,"nix",null,"Kč","R"]
[null,{"$f":"Calculation!C216","v":0},{"$f":"HLOOKUP(Main!$C$2,Translating_products!$CN$4:$DD$216,Translating_products!CM132, FALSE)","v":200180},{"$f":"HLOOKUP(Main!$C$2,Translating_products!$DI$4:$DY$216,Translating_products!CM132, FALSE)","v":"24 pólová propojka (10 kusů)"},{"$f":"IF(ISBLANK($Q$1),HLOOKUP(Main!$C$2,Translating_products!$EE$4:$EU$216,Translating_products!CM132,FALSE),HLOOKUP($Q$1,Translating_products!$EE$4:$EU$216,Translating_products!CM132,FALSE))","v":1699},2055.79,0,"Stück-Auswahl Verteiler","Verteiler",null,null,null,null,null,"nix",null,"Kč","R"]
[null,{"$f":"Calculation!C217","v":0},{"$f":"HLOOKUP(Main!$C$2,Translating_products!$CN$4:$DD$216,Translating_products!CM133, FALSE)","v":200181},{"$f":"HLOOKUP(Main!$C$2,Translating_products!$DI$4:$DY$216,Translating_products!CM133, FALSE)","v":"Pojistky 2A (100 kusů)"},{"$f":"IF(ISBLANK($Q$1),HLOOKUP(Main!$C$2,Translating_products!$EE$4:$EU$216,Translating_products!CM133,FALSE),HLOOKUP($Q$1,Translating_products!$EE$4:$EU$216,Translating_products!CM133,FALSE))","v":249},301.28999999999996,{"$f":"B133*F133","v":0},"Stück-Auswahl Verteiler","Verteiler",null,null,null,null,null,"nix",null,"Kč","R"]
[null,{"$f":"Calculation!C218","v":0},{"$f":"HLOOKUP(Main!$C$2,Translating_products!$CN$4:$DD$216,Translating_products!CM134, FALSE)","v":200183},{"$f":"HLOOKUP(Main!$C$2,Translating_products!$DI$4:$DY$216,Translating_products!CM134, FALSE)","v":"Pojistky 5A (100 kusů)"},{"$f":"IF(ISBLANK($Q$1),HLOOKUP(Main!$C$2,Translating_products!$EE$4:$EU$216,Translating_products!CM134,FALSE),HLOOKUP($Q$1,Translating_products!$EE$4:$EU$216,Translating_products!CM134,FALSE))","v":249},301.28999999999996,0,"Stück-Auswahl Verteiler","Verteiler",null,null,null,null,null,"nix",null,"Kč","R"]
[null,{"$f":"Calculation!C219","v":0},{"$f":"HLOOKUP(Main!$C$2,Translating_products!$CN$4:$DD$216,Translating_products!CM135, FALSE)","v":200184},{"$f":"HLOOKUP(Main!$C$2,Translating_products!$DI$4:$DY$216,Translating_products!CM135, FALSE)","v":"Pojistky 10A (100 kusů)"},{"$f":"IF(ISBLANK($Q$1),HLOOKUP(Main!$C$2,Translating_products!$EE$4:$EU$216,Translating_products!CM135,FALSE),HLOOKUP($Q$1,Translating_products!$EE$4:$EU$216,Translating_products!CM135,FALSE))","v":249},{"$f":"E135*(1+$E$197*0.01)","v":301.28999999999996},0,"Stück-Auswahl Verteiler","Verteiler",null,null,null,null,null,"nix",null,{"$f":"$Q$7","v":"Kč"},"R"]
[null,{"$f":"Calculation!C344","v":0},{"$f":"HLOOKUP(Main!$C$2,Translating_products!$CN$4:$DD$216,Translating_products!CM136, FALSE)","v":200193},{"$f":"HLOOKUP(Main!$C$2,Translating_products!$DI$4:$DY$216,Translating_products!CM136, FALSE)","v":"Loxone brožurka - 25 kusů"},{"$f":"IF(ISBLANK($Q$1),HLOOKUP(Main!$C$2,Translating_products!$EE$4:$EU$216,Translating_products!CM136,FALSE),HLOOKUP($Q$1,Translating_products!$EE$4:$EU$216,Translating_products!CM136,FALSE))","v":85},102.85,0,"Stück-Auswahl Sonstiges","Sonstiges",null,null,null,null,null,"nix",null,"Kč","R"]
[null,{"$f":"Calculation!C161","v":0},{"$f":"HLOOKUP(Main!$C$2,Translating_products!$CN$4:$DD$216,Translating_products!CM137, FALSE)","v":200191},{"$f":"HLOOKUP(Main!$C$2,Translating_products!$DI$4:$DY$216,Translating_products!CM137, FALSE)","v":"čtečka elektronického klíče - nerez"},{"$f":"IF(ISBLANK($Q$1),HLOOKUP(Main!$C$2,Translating_products!$EE$4:$EU$216,Translating_products!CM137,FALSE),HLOOKUP($Q$1,Translating_products!$EE$4:$EU$216,Translating_products!CM137,FALSE))","v":779},942.58999999999992,0,"belegt 1 kanal von 1 Wire (Zutritt)","Zutritt",null,null,null,null,1,"nix",null,"Kč","R"]
[null,{"$f":"Calculation!C318","v":0},{"$f":"HLOOKUP(Main!$C$2,Translating_products!$CN$4:$DD$216,Translating_products!CM138, FALSE)","v":200207},{"$f":"HLOOKUP(Main!$C$2,Translating_products!$DI$4:$DY$216,Translating_products!CM138, FALSE)","v":"Keba KeContact P20 Wallbox"},{"$f":"IF(ISBLANK($Q$1),HLOOKUP(Main!$C$2,Translating_products!$EE$4:$EU$216,Translating_products!CM138,FALSE),HLOOKUP($Q$1,Translating_products!$EE$4:$EU$216,Translating_products!CM138,FALSE))","v":22999},27828.79,0,"Stück-Auswahl Sonstiges","Sonstiges",null,null,null,null,null,"nix",null,"Kč","R"]
[null,{"$f":"Calculation!C129","v":5},{"$f":"HLOOKUP(Main!$C$2,Translating_products!$CN$4:$DD$216,Translating_products!CM139, FALSE)","v":200202},{"$f":"HLOOKUP(Main!$C$2,Translating_products!$DI$4:$DY$216,Translating_products!CM139, FALSE)","v":"Loxone Speaker back box pro snížené stropy"},{"$f":"IF(ISBLANK($Q$1),HLOOKUP(Main!$C$2,Translating_products!$EE$4:$EU$216,Translating_products!CM139,FALSE),HLOOKUP($Q$1,Translating_products!$EE$4:$EU$216,Translating_products!CM139,FALSE))","v":999},1208.79,6043.95,"Stück-Auswahl Musik","Musik",null,null,null,null,null,"nix",null,"Kč","M"]
[null,{"$f":"Calculation!C91","v":0},{"$f":"HLOOKUP(Main!$C$2,Translating_products!$CN$4:$DD$216,Translating_products!CM140, FALSE)","v":200280},{"$f":"HLOOKUP(Main!$C$2,Translating_products!$DI$4:$DY$216,Translating_products!CM140, FALSE)","v":"Příslušenství k LED páskům - set RGBW"},{"$f":"IF(ISBLANK($Q$1),HLOOKUP(Main!$C$2,Translating_products!$EE$4:$EU$216,Translating_products!CM140,FALSE),HLOOKUP($Q$1,Translating_products!$EE$4:$EU$216,Translating_products!CM140,FALSE))","v":449},543.29,0,null,null,null,null,null,null,null,null,null,"Kč","L"]
[null,{"$f":"Calculation!C92","v":0},{"$f":"HLOOKUP(Main!$C$2,Translating_products!$CN$4:$DD$216,Translating_products!CM141, FALSE)","v":200278},{"$f":"HLOOKUP(Main!$C$2,Translating_products!$DI$4:$DY$216,Translating_products!CM141, FALSE)","v":"Příslušenství k LED páskům - set WW"},{"$f":"IF(ISBLANK($Q$1),HLOOKUP(Main!$C$2,Translating_products!$EE$4:$EU$216,Translating_products!CM141,FALSE),HLOOKUP($Q$1,Translating_products!$EE$4:$EU$216,Translating_products!CM141,FALSE))","v":325},393.25,0,null,null,null,null,null,null,null,null,null,"Kč","L"]
[null,{"$f":"Calculation!C317","v":0},{"$f":"IF(ISBLANK($Q$1), HLOOKUP(Main!$C$2,Translating_products!$CN$4:$DD$216,Translating_products!CM142, FALSE), HLOOKUP($Q$1,Translating_products!$CN$4:$DD$216,Translating_products!CM142, FALSE))","v":200161},{"$f":"HLOOKUP(Main!$C$2,Translating_products!$DI$4:$DY$216,Translating_products!CM142, FALSE)","v":"Napájecí zdroj do zásuvky 24V, 6,25A Typ E,F"},{"$f":"IF(ISBLANK($Q$1),HLOOKUP(Main!$C$2,Translating_products!$EE$4:$EU$216,Translating_products!CM142,FALSE),HLOOKUP($Q$1,Translating_products!$EE$4:$EU$216,Translating_products!CM142,FALSE))","v":1799},2176.79,0,null,null,null,null,null,null,null,null,null,"Kč","R"]
[null,{"$f":"Calculation!C128","v":0},{"$f":"HLOOKUP(Main!$C$2,Translating_products!$CN$4:$DD$216,Translating_products!CM143, FALSE)","v":100205},{"$f":"HLOOKUP(Main!$C$2,Translating_products!$DI$4:$DY$216,Translating_products!CM143, FALSE)","v":"Loxone Music Server Upgrade"},{"$f":"IF(ISBLANK($Q$1),HLOOKUP(Main!$C$2,Translating_products!$EE$4:$EU$216,Translating_products!CM143,FALSE),HLOOKUP($Q$1,Translating_products!$EE$4:$EU$216,Translating_products!CM143,FALSE))","v":2699},3265.79,0,null,null,null,null,null,null,null,null,null,"Kč","M"]
[null,{"$f":"Calculation!C162","v":1},{"$f":"IF(ISBLANK($Q$1),HLOOKUP(Main!$C$2,Translating_products!$CN$4:$DD$216,Translating_products!CM144,FALSE),HLOOKUP($Q$1,Translating_products!$CN$4:$DD$216,Translating_products!CM144,FALSE))","v":200273},{"$f":"HLOOKUP(Main!$C$2,Translating_products!$DI$4:$DY$216,Translating_products!CM144, FALSE)","v":"Loxone Intercom XL"},{"$f":"IF(ISBLANK($Q$1),HLOOKUP(Main!$C$2,Translating_products!$EE$4:$EU$216,Translating_products!CM144,FALSE),HLOOKUP($Q$1,Translating_products!$EE$4:$EU$216,Translating_products!CM144,FALSE))","v":31499},38113.79,{"$f":"B144*F144","v":38113.79},"Stück-Auswähl Zutritt","Zutritt",null,null,null,null,null,"nix",null,"Kč","R"]
[null,{"$f":"Calculation!C249","v":1},{"$f":"HLOOKUP(Main!$C$2,Translating_products!$CN$4:$DD$216,Translating_products!CM145, FALSE)","v":100190},{"$f":"HLOOKUP(Main!$C$2,Translating_products!$DI$4:$DY$216,Translating_products!CM145, FALSE)","v":"Pohybový senzor Air"},{"$f":"IF(ISBLANK($Q$1),HLOOKUP(Main!$C$2,Translating_products!$EE$4:$EU$216,Translating_products!CM145,FALSE),HLOOKUP($Q$1,Translating_products!$EE$4:$EU$216,Translating_products!CM145,FALSE))","v":2249},2721.29,{"$f":"B145*F145","v":2721.29},null,null,null,null,null,null,1,null,null,"Kč","R"]
[null,{"$f":"Calculation!C319","v":0},{"$f":"HLOOKUP(Main!$C$2,Translating_products!$CN$4:$DD$216,Translating_products!CM146, FALSE)","v":200281},{"$f":"HLOOKUP(Main!$C$2,Translating_products!$DI$4:$DY$216,Translating_products!CM146, FALSE)","v":"NFC Smart tagy"},{"$f":"IF(ISBLANK($Q$1),HLOOKUP(Main!$C$2,Translating_products!$EE$4:$EU$216,Translating_products!CM146,FALSE),HLOOKUP($Q$1,Translating_products!$EE$4:$EU$216,Translating_products!CM146,FALSE))","v":629},761.09,{"$f":"B146*F146","v":0},null,null,null,null,null,null,null,null,null,"Kč","R"]
[null,{"$f":"Calculation!C95","v":9},{"$f":"HLOOKUP(Main!$C$2,Translating_products!$CN$4:$DD$216,Translating_products!CM147, FALSE)","v":100204},{"$f":"HLOOKUP(Main!$C$2,Translating_products!$DI$4:$DY$216,Translating_products!CM147, FALSE)","v":"LED Spot RGBW"},{"$f":"IF(ISBLANK($Q$1),HLOOKUP(Main!$C$2,Translating_products!$EE$4:$EU$216,Translating_products!CM147,FALSE),HLOOKUP($Q$1,Translating_products!$EE$4:$EU$216,Translating_products!CM147,FALSE))","v":1349},1632.29,{"$f":"B147*F147","v":14690.61},null,null,null,null,null,null,null,null,null,"Kč","L"]
[null,{"$f":"Calculation!C96","v":24},{"$f":"HLOOKUP(Main!$C$2,Translating_products!$CN$4:$DD$216,Translating_products!CM148, FALSE)","v":100203},{"$f":"HLOOKUP(Main!$C$2,Translating_products!$DI$4:$DY$216,Translating_products!CM148, FALSE)","v":"LED Spot WW"},{"$f":"IF(ISBLANK($Q$1),HLOOKUP(Main!$C$2,Translating_products!$EE$4:$EU$216,Translating_products!CM148,FALSE),HLOOKUP($Q$1,Translating_products!$EE$4:$EU$216,Translating_products!CM148,FALSE))","v":899},1087.79,26106.959999999999,null,null,null,null,null,null,null,null,null,"Kč","L"]
[null,{"$f":"Calculation!C320","v":0},{"$f":"HLOOKUP(Main!$C$2,Translating_products!$CN$4:$DD$216,Translating_products!CM149, FALSE)","v":200294},{"$f":"HLOOKUP(Main!$C$2,Translating_products!$DI$4:$DY$216,Translating_products!CM149, FALSE)","v":"Nabíjecí kabel typ 2"},{"$f":"IF(ISBLANK($Q$1),HLOOKUP(Main!$C$2,Translating_products!$EE$4:$EU$216,Translating_products!CM149,FALSE),HLOOKUP($Q$1,Translating_products!$EE$4:$EU$216,Translating_products!CM149,FALSE))","v":8599},10404.789999999999,0,null,null,null,null,null,null,null,null,null,"Kč","R"]
[null,{"$f":"Calculation!C269+Calculation!C45+Calculation!C409","v":1},{"$f":"HLOOKUP(Main!$C$2,Translating_products!$CN$4:$DD$216,Translating_products!CM150, FALSE)","v":100218},{"$f":"HLOOKUP(Main!$C$2,Translating_products!$DI$4:$DY$216,Translating_products!CM150, FALSE)","v":"Tree Extension"},{"$f":"IF(ISBLANK($Q$1),HLOOKUP(Main!$C$2,Translating_products!$EE$4:$EU$216,Translating_products!CM150,FALSE),HLOOKUP($Q$1,Translating_products!$EE$4:$EU$216,Translating_products!CM150,FALSE))","v":2099},2539.79,2539.79,null,"Tree",null,null,null,null,100,4.7999999999999996E-3,null,"Kč","R"]
[null,{"$f":"Calculation!C270+Calculation!C381","v":5},{"$f":"HLOOKUP(Main!$C$2,Translating_products!$CN$4:$DD$216,Translating_products!CM151, FALSE)","v":100221},{"$f":"HLOOKUP(Main!$C$2,Translating_products!$DI$4:$DY$216,Translating_products!CM151, FALSE)","v":"Touch Tree bílá"},{"$f":"IF(ISBLANK($Q$1),HLOOKUP(Main!$C$2,Translating_products!$EE$4:$EU$216,Translating_products!CM151,FALSE),HLOOKUP($Q$1,Translating_products!$EE$4:$EU$216,Translating_products!CM151,FALSE))","v":1849},2237.29,11186.45,null,"Tree",null,null,null,null,1,4.7999999999999996E-3,null,"Kč","R"]
[null,{"$f":"Calculation!C271+Calculation!C384","v":0},{"$f":"HLOOKUP(Main!$C$2,Translating_products!$CN$4:$DD$216,Translating_products!CM152, FALSE)","v":100222},{"$f":"HLOOKUP(Main!$C$2,Translating_products!$DI$4:$DY$216,Translating_products!CM152, FALSE)","v":"Touch Tree anthrazit"},{"$f":"IF(ISBLANK($Q$1),HLOOKUP(Main!$C$2,Translating_products!$EE$4:$EU$216,Translating_products!CM152,FALSE),HLOOKUP($Q$1,Translating_products!$EE$4:$EU$216,Translating_products!CM152,FALSE))","v":1849},2237.29,0,null,"Tree",null,null,null,null,1,4.7999999999999996E-3,null,"Kč","R"]
[null,{"$f":"Calculation!C272+Calculation!C191","v":7},{"$f":"HLOOKUP(Main!$C$2,Translating_products!$CN$4:$DD$216,Translating_products!CM153, FALSE)","v":100223},{"$f":"HLOOKUP(Main!$C$2,Translating_products!$DI$4:$DY$216,Translating_products!CM153, FALSE)","v":"Motion Sensor Tree bilá"},{"$f":"IF(ISBLANK($Q$1),HLOOKUP(Main!$C$2,Translating_products!$EE$4:$EU$216,Translating_products!CM153,FALSE),HLOOKUP($Q$1,Translating_products!$EE$4:$EU$216,Translating_products!CM153,FALSE))","v":1999},2418.79,16931.53,null,"Tree",null,null,null,null,1,4.7999999999999996E-3,null,"Kč","R"]
[null,{"$f":"Calculation!C273+Calculation!C143","v":6},{"$f":"HLOOKUP(Main!$C$2,Translating_products!$CN$4:$DD$216,Translating_products!CM154, FALSE)","v":100225},{"$f":"HLOOKUP(Main!$C$2,Translating_products!$DI$4:$DY$216,Translating_products!CM154, FALSE)","v":"Hlavice Tree"},{"$f":"IF(ISBLANK($Q$1),HLOOKUP(Main!$C$2,Translating_products!$EE$4:$EU$216,Translating_products!CM154,FALSE),HLOOKUP($Q$1,Translating_products!$EE$4:$EU$216,Translating_products!CM154,FALSE))","v":1749},2116.29,12697.74,null,"Tree",null,null,null,null,1,6.25E-2,null,"Kč","H"]
[null,{"$f":"Calculation!C251+Calculation!C192","v":1},{"$f":"HLOOKUP(Main!$C$2,Translating_products!$CN$4:$DD$216,Translating_products!CM155, FALSE)","v":100211},{"$f":"HLOOKUP(Main!$C$2,Translating_products!$DI$4:$DY$216,Translating_products!CM155, FALSE)","v":"Záplavový senzor Air"},{"$f":"IF(ISBLANK($Q$1),HLOOKUP(Main!$C$2,Translating_products!$EE$4:$EU$216,Translating_products!CM155,FALSE),HLOOKUP($Q$1,Translating_products!$EE$4:$EU$216,Translating_products!CM155,FALSE))","v":1449},1753.29,1753.29,null,"Air",null,null,null,null,1,null,null,"Kč","R"]
[null,{"$f":"Calculation!C252+Calculation!C193","v":0},{"$f":"HLOOKUP(Main!$C$2,Translating_products!$CN$4:$DD$216,Translating_products!CM156, FALSE)","v":100213},{"$f":"HLOOKUP(Main!$C$2,Translating_products!$DI$4:$DY$216,Translating_products!CM156, FALSE)","v":"Okenní a dveřní kontakt Air anthrazit"},{"$f":"IF(ISBLANK($Q$1),HLOOKUP(Main!$C$2,Translating_products!$EE$4:$EU$216,Translating_products!CM156,FALSE),HLOOKUP($Q$1,Translating_products!$EE$4:$EU$216,Translating_products!CM156,FALSE))","v":1449},1753.29,0,null,"Air",null,null,null,null,1,null,null,"Kč","R"]
[null,{"$f":"Calculation!C253+Calculation!C194","v":0},{"$f":"HLOOKUP(Main!$C$2,Translating_products!$CN$4:$DD$216,Translating_products!CM157, FALSE)","v":100210},{"$f":"HLOOKUP(Main!$C$2,Translating_products!$DI$4:$DY$216,Translating_products!CM157, FALSE)","v":"Okenní a dveřní kontakt Air bílá"},{"$f":"IF(ISBLANK($Q$1),HLOOKUP(Main!$C$2,Translating_products!$EE$4:$EU$216,Translating_products!CM157,FALSE),HLOOKUP($Q$1,Translating_products!$EE$4:$EU$216,Translating_products!CM157,FALSE))","v":1449},1753.29,0,null,"Air",null,null,null,null,1,null,null,"Kč","R"]
[null,{"$f":"Calculation!C274+Calculation!C190","v":0},{"$f":"HLOOKUP(Main!$C$2,Translating_products!$CN$4:$DD$216,Translating_products!CM158, FALSE)","v":100224},{"$f":"HLOOKUP(Main!$C$2,Translating_products!$DI$4:$DY$216,Translating_products!CM158, FALSE)","v":"Pohybový senzor Tree anthrazit"},{"$f":"IF(ISBLANK($Q$1),HLOOKUP(Main!$C$2,Translating_products!$EE$4:$EU$216,Translating_products!CM158,FALSE),HLOOKUP($Q$1,Translating_products!$EE$4:$EU$216,Translating_products!CM158,FALSE))","v":1999},2418.79,0,null,null,null,null,null,null,null,null,null,"Kč","R"]
[null,{"$f":"Calculation!C222","v":0},{"$f":"HLOOKUP(Main!$C$2,Translating_products!$CN$4:$DD$216,Translating_products!CM159, FALSE)","v":200204},{"$f":"HLOOKUP(Main!$C$2,Translating_products!$DI$4:$DY$216,Translating_products!CM159, FALSE)","v":"20-ti pólová propojka Weidmuller (20 ks)"},{"$f":"IF(ISBLANK($Q$1),HLOOKUP(Main!$C$2,Translating_products!$EE$4:$EU$216,Translating_products!CM159,FALSE),HLOOKUP($Q$1,Translating_products!$EE$4:$EU$216,Translating_products!CM159,FALSE))","v":2399},2902.79,0,null,null,null,null,null,null,null,null,null,"Kč","R"]
[null,{"$f":"Calculation!C410+Calculation!C46","v":0},{"$f":"HLOOKUP(Main!$C$2,Translating_products!$CN$4:$DD$216,Translating_products!CM160, FALSE)","v":100200},{"$f":"HLOOKUP(Main!$C$2,Translating_products!$DI$4:$DY$216,Translating_products!CM160, FALSE)","v":"Dali Extension"},{"$f":"IF(ISBLANK($Q$1),HLOOKUP(Main!$C$2,Translating_products!$EE$4:$EU$216,Translating_products!CM160,FALSE),HLOOKUP($Q$1,Translating_products!$EE$4:$EU$216,Translating_products!CM160,FALSE))","v":12199},14760.789999999999,0,null,null,null,null,null,null,null,null,null,"Kč","L"]
[null,{"$f":"Calculation!C321","v":0},{"$f":"HLOOKUP(Main!$C$2,Translating_products!$CN$4:$DD$216,Translating_products!CM161, FALSE)","v":200297},{"$f":"HLOOKUP(Main!$C$2,Translating_products!$DI$4:$DY$216,Translating_products!CM161, FALSE)","v":"Spínaný LED zdroj 24V 2,5A"},{"$f":"IF(ISBLANK($Q$1),HLOOKUP(Main!$C$2,Translating_products!$EE$4:$EU$216,Translating_products!CM161,FALSE),HLOOKUP($Q$1,Translating_products!$EE$4:$EU$216,Translating_products!CM161,FALSE))","v":799},966.79,0,null,null,null,null,null,null,null,null,null,"Kč","R"]
[null,{"$f":"Calculation!C275+Calculation!C255+Calculation!C385","v":0},{"$f":"HLOOKUP(Main!$C$2,Translating_products!$CN$4:$DD$216,Translating_products!CM162, FALSE)","v":100206},{"$f":"HLOOKUP(Main!$C$2,Translating_products!$DI$4:$DY$216,Translating_products!CM162, FALSE)","v":"Touch pure Air bílá"},{"$f":"IF(ISBLANK($Q$1),HLOOKUP(Main!$C$2,Translating_products!$EE$4:$EU$216,Translating_products!CM162,FALSE),HLOOKUP($Q$1,Translating_products!$EE$4:$EU$216,Translating_products!CM162,FALSE))","v":3999},4838.79,0,null,null,null,null,null,null,null,null,null,"Kč","R"]
[null,{"$f":"Calculation!C275+Calculation!C254+Calculation!C382","v":0},{"$f":"HLOOKUP(Main!$C$2,Translating_products!$CN$4:$DD$216,Translating_products!CM163, FALSE)","v":100207},{"$f":"HLOOKUP(Main!$C$2,Translating_products!$DI$4:$DY$216,Translating_products!CM163, FALSE)","v":"Touch pure for Nano bílá"},{"$f":"IF(ISBLANK($Q$1),HLOOKUP(Main!$C$2,Translating_products!$EE$4:$EU$216,Translating_products!CM163,FALSE),HLOOKUP($Q$1,Translating_products!$EE$4:$EU$216,Translating_products!CM163,FALSE))","v":3199},3870.79,0,null,null,null,null,null,null,null,null,null,"Kč","R"]
[null,{"$f":"Calculation!C276+Calculation!C383","v":4},{"$f":"HLOOKUP(Main!$C$2,Translating_products!$CN$4:$DD$216,Translating_products!CM164, FALSE)","v":100219},{"$f":"HLOOKUP(Main!$C$2,Translating_products!$DI$4:$DY$216,Translating_products!CM164, FALSE)","v":"Touch pure Tree bílá"},{"$f":"IF(ISBLANK($Q$1),HLOOKUP(Main!$C$2,Translating_products!$EE$4:$EU$216,Translating_products!CM164,FALSE),HLOOKUP($Q$1,Translating_products!$EE$4:$EU$216,Translating_products!CM164,FALSE))","v":3999},4838.79,19355.16,null,null,null,null,null,null,null,null,null,"Kč","R"]
[null,{"$f":"Calculation!C411","v":0},{"$f":"HLOOKUP(Main!$C$2,Translating_products!$CN$4:$DD$216,Translating_products!CM165, FALSE)","v":200108},{"$f":"IF(ISBLANK(Q1), HLOOKUP(Main!$C$2,Translating_products!$DI$4:$DY$216,Translating_products!CM165, FALSE),\"Not available in this country\")","v":"Internorm Extension"},{"$f":"IF(ISBLANK($Q$1),HLOOKUP(Main!$C$2,Translating_products!$EE$4:$EU$216,Translating_products!CM165,FALSE),HLOOKUP($Q$1,Translating_products!$EE$4:$EU$216,Translating_products!CM165,FALSE))","v":6799},8226.7899999999991,0,null,null,null,null,null,null,null,null,null,"Kč","R"]
[null,{"$f":"Calculation!C256","v":0},{"$f":"HLOOKUP(Main!$C$2,Translating_products!$CN$4:$DD$216,Translating_products!CM166, FALSE)","v":100212},{"$f":"HLOOKUP(Main!$C$2,Translating_products!$DI$4:$DY$216,Translating_products!CM166, FALSE)","v":"Nano Dimmer Air"},{"$f":"IF(ISBLANK($Q$1),HLOOKUP(Main!$C$2,Translating_products!$EE$4:$EU$216,Translating_products!CM166,FALSE),HLOOKUP($Q$1,Translating_products!$EE$4:$EU$216,Translating_products!CM166,FALSE))","v":2499},3023.79,0,null,null,null,null,null,null,null,null,null,"Kč","R"]
[null,{"$f":"Calculation!C322","v":0},{"$f":"HLOOKUP(Main!$C$2,Translating_products!$CN$4:$DD$216,Translating_products!CM167, FALSE)","v":200300},{"$f":"HLOOKUP(Main!$C$2,Translating_products!$DI$4:$DY$216,Translating_products!CM167, FALSE)","v":"Dvoužilový kroucený kabel modrá/bílá"},{"$f":"IF(ISBLANK($Q$1),HLOOKUP(Main!$C$2,Translating_products!$EE$4:$EU$216,Translating_products!CM167,FALSE),HLOOKUP($Q$1,Translating_products!$EE$4:$EU$216,Translating_products!CM167,FALSE))","v":299},{"$f":"E167*(1+$E$197*0.01)","v":361.78999999999996},0,null,null,null,null,null,null,null,null,null,"Kč","R"]
[null,{"$f":"Calculation!C323","v":0},{"$f":"HLOOKUP(Main!$C$2,Translating_products!$CN$4:$DD$216,Translating_products!CM168, FALSE)","v":200301},{"$f":"HLOOKUP(Main!$C$2,Translating_products!$DI$4:$DY$216,Translating_products!CM168, FALSE)","v":"Dvoužilový kroucený kabel oranžová/bílá"},{"$f":"IF(ISBLANK($Q$1),HLOOKUP(Main!$C$2,Translating_products!$EE$4:$EU$216,Translating_products!CM168,FALSE),HLOOKUP($Q$1,Translating_products!$EE$4:$EU$216,Translating_products!CM168,FALSE))","v":299},361.78999999999996,0,null,null,null,null,null,null,null,null,null,"Kč","R"]
[null,{"$f":"Calculation!C324","v":0},{"$f":"HLOOKUP(Main!$C$2,Translating_products!$CN$4:$DD$216,Translating_products!CM169, FALSE)","v":200302},{"$f":"HLOOKUP(Main!$C$2,Translating_products!$DI$4:$DY$216,Translating_products!CM169, FALSE)","v":"Dvoužilový kroucený kabel zelená/bílá"},{"$f":"IF(ISBLANK($Q$1),HLOOKUP(Main!$C$2,Translating_products!$EE$4:$EU$216,Translating_products!CM169,FALSE),HLOOKUP($Q$1,Translating_products!$EE$4:$EU$216,Translating_products!CM169,FALSE))","v":299},361.78999999999996,0,null,null,null,null,null,null,null,null,null,"Kč","R"]
[null,{"$f":"Calculation!C325","v":0},{"$f":"HLOOKUP(Main!$C$2,Translating_products!$CN$4:$DD$216,Translating_products!CM170, FALSE)","v":200287},{"$f":"HLOOKUP(Main!$C$2,Translating_products!$DI$4:$DY$216,Translating_products!CM170, FALSE)","v":"Duracell Plus Power AA (12 ks)"},{"$f":"IF(ISBLANK($Q$1),HLOOKUP(Main!$C$2,Translating_products!$EE$4:$EU$216,Translating_products!CM170,FALSE),HLOOKUP($Q$1,Translating_products!$EE$4:$EU$216,Translating_products!CM170,FALSE))","v":215},260.14999999999998,0,null,null,null,null,null,null,null,null,null,"Kč","R"]
[null,{"$f":"Calculation!C326","v":0},{"$f":"HLOOKUP(Main!$C$2,Translating_products!$CN$4:$DD$216,Translating_products!CM171, FALSE)","v":200288},{"$f":"HLOOKUP(Main!$C$2,Translating_products!$DI$4:$DY$216,Translating_products!CM171, FALSE)","v":"Duracell Plus Power AAA (12 ks)"},{"$f":"IF(ISBLANK($Q$1),HLOOKUP(Main!$C$2,Translating_products!$EE$4:$EU$216,Translating_products!CM171,FALSE),HLOOKUP($Q$1,Translating_products!$EE$4:$EU$216,Translating_products!CM171,FALSE))","v":215},260.14999999999998,0,null,null,null,null,null,null,null,null,null,"Kč","R"]
[null,{"$f":"Calculation!C327","v":0},{"$f":"HLOOKUP(Main!$C$2,Translating_products!$CN$4:$DD$216,Translating_products!CM172, FALSE)","v":200289},{"$f":"HLOOKUP(Main!$C$2,Translating_products!$DI$4:$DY$216,Translating_products!CM172, FALSE)","v":"CR2032 Lithium Battery (20 ks)"},{"$f":"IF(ISBLANK($Q$1),HLOOKUP(Main!$C$2,Translating_products!$EE$4:$EU$216,Translating_products!CM172,FALSE),HLOOKUP($Q$1,Translating_products!$EE$4:$EU$216,Translating_products!CM172,FALSE))","v":269},325.49,0,null,null,null,null,null,null,null,null,null,"Kč","R"]
[null,{"$f":"Calculation!C328","v":0},{"$f":"HLOOKUP(Main!$C$2,Translating_products!$CN$4:$DD$216,Translating_products!CM173, FALSE)","v":200290},{"$f":"HLOOKUP(Main!$C$2,Translating_products!$DI$4:$DY$216,Translating_products!CM173, FALSE)","v":"CR2450 Lithium Battery (20 ks)"},{"$f":"IF(ISBLANK($Q$1),HLOOKUP(Main!$C$2,Translating_products!$EE$4:$EU$216,Translating_products!CM173,FALSE),HLOOKUP($Q$1,Translating_products!$EE$4:$EU$216,Translating_products!CM173,FALSE))","v":599},724.79,0,null,null,null,null,null,null,null,null,null,"Kč","R"]
[null,{"$f":"Calculation!C329","v":0},{"$f":"HLOOKUP(Main!$C$2,Translating_products!$CN$4:$DD$216,Translating_products!CM174, FALSE)","v":200291},{"$f":"HLOOKUP(Main!$C$2,Translating_products!$DI$4:$DY$216,Translating_products!CM174, FALSE)","v":"FDK 9V Lithium Battery"},{"$f":"IF(ISBLANK($Q$1),HLOOKUP(Main!$C$2,Translating_products!$EE$4:$EU$216,Translating_products!CM174,FALSE),HLOOKUP($Q$1,Translating_products!$EE$4:$EU$216,Translating_products!CM174,FALSE))","v":245},296.45,0,null,null,null,null,null,null,null,null,null,"Kč","R"]
[null,{"$f":"Calculation!C277","v":0},{"$f":"HLOOKUP(Main!$C$2,Translating_products!$CN$4:$DD$216,Translating_products!CM175, FALSE)","v":100242},{"$f":"HLOOKUP(Main!$C$2,Translating_products!$DI$4:$DY$216,Translating_products!CM175, FALSE)","v":"Nano DI Tree"},{"$f":"IF(ISBLANK($Q$1),HLOOKUP(Main!$C$2,Translating_products!$EE$4:$EU$216,Translating_products!CM175,FALSE),HLOOKUP($Q$1,Translating_products!$EE$4:$EU$216,Translating_products!CM175,FALSE))","v":1699},2055.79,0,null,null,null,null,null,null,null,null,null,"Kč","R"]
[null,{"$f":"IF(ISBLANK(Q1),0,Calculation!C330)","v":0},{"$f":"IF(ISBLANK(Q1),\"0\",\"100294\")","v":"0"},{"$f":"IF(ISBLANK(Q1),\"not available in this country\", HLOOKUP(Main!$C$2,Translating_products!$DI$4:$DY$216,Translating_products!CM176, FALSE))","v":"not available in this country"},{"$f":"IF(ISBLANK(Q1),\"0\",IF(ISBLANK($Q$1),HLOOKUP(Main!$C$2,Translating_products!$EE$4:$EU$216,Translating_products!CM176,FALSE),HLOOKUP($Q$1,Translating_products!$EE$4:$EU$216,Translating_products!CM176,FALSE)))","v":"0"},0,0,null,null,null,null,null,null,null,null,null,"Kč","R"]
[null,{"$f":"Calculation!C386+Calculation!C257","v":0},{"$f":"HLOOKUP(Main!$C$2,Translating_products!$CN$4:$DD$216,Translating_products!CM177, FALSE)","v":100209},{"$f":"HLOOKUP(Main!$C$2,Translating_products!$DI$4:$DY$216,Translating_products!CM177, FALSE)","v":"Touch pure for Nano Anthracite"},{"$f":"IF(ISBLANK($Q$1),HLOOKUP(Main!$C$2,Translating_products!$EE$4:$EU$216,Translating_products!CM177,FALSE),HLOOKUP($Q$1,Translating_products!$EE$4:$EU$216,Translating_products!CM177,FALSE))","v":3199},3870.79,0,null,null,null,null,null,null,null,null,null,"Kč","R"]
[null,{"$f":"Calculation!C387+Calculation!C278","v":0},{"$f":"HLOOKUP(Main!$C$2,Translating_products!$CN$4:$DD$216,Translating_products!CM178, FALSE)","v":100220},{"$f":"HLOOKUP(Main!$C$2,Translating_products!$DI$4:$DY$216,Translating_products!CM178, FALSE)","v":"Touch pure for Tree Anthracite"},{"$f":"IF(ISBLANK($Q$1),HLOOKUP(Main!$C$2,Translating_products!$EE$4:$EU$216,Translating_products!CM178,FALSE),HLOOKUP($Q$1,Translating_products!$EE$4:$EU$216,Translating_products!CM178,FALSE))","v":3999},4838.79,0,null,null,null,null,null,null,null,null,null,"Kč","R"]
[null,{"$f":"Calculation!C258+Calculation!C388","v":0},{"$f":"HLOOKUP(Main!$C$2,Translating_products!$CN$4:$DD$216,Translating_products!CM179, FALSE)","v":100208},{"$f":"HLOOKUP(Main!$C$2,Translating_products!$DI$4:$DY$216,Translating_products!CM179, FALSE)","v":"Touch pure Air Anthracite"},{"$f":"IF(ISBLANK($Q$1),HLOOKUP(Main!$C$2,Translating_products!$EE$4:$EU$216,Translating_products!CM179,FALSE),HLOOKUP($Q$1,Translating_products!$EE$4:$EU$216,Translating_products!CM179,FALSE))","v":3999},4838.79,0,null,null,null,null,null,null,null,null,null,"Kč","R"]
[null,{"$f":"Calculation!C98","v":0},{"$f":"HLOOKUP(Main!$C$2,Translating_products!$CN$4:$DD$216,Translating_products!CM180, FALSE)","v":100235},{"$f":"HLOOKUP(Main!$C$2,Translating_products!$DI$4:$DY$216,Translating_products!CM180, FALSE)","v":"Příložný LED Spot RGBW bílá"},{"$f":"IF(ISBLANK($Q$1),HLOOKUP(Main!$C$2,Translating_products!$EE$4:$EU$216,Translating_products!CM180,FALSE),HLOOKUP($Q$1,Translating_products!$EE$4:$EU$216,Translating_products!CM180,FALSE))","v":2149},2600.29,0,null,null,null,null,null,null,null,null,null,"Kč","L"]
[null,{"$f":"Calculation!C99","v":0},{"$f":"HLOOKUP(Main!$C$2,Translating_products!$CN$4:$DD$216,Translating_products!CM181, FALSE)","v":100236},{"$f":"HLOOKUP(Main!$C$2,Translating_products!$DI$4:$DY$216,Translating_products!CM181, FALSE)","v":"Příložný LED Spot WW bílá"},{"$f":"IF(ISBLANK($Q$1),HLOOKUP(Main!$C$2,Translating_products!$EE$4:$EU$216,Translating_products!CM181,FALSE),HLOOKUP($Q$1,Translating_products!$EE$4:$EU$216,Translating_products!CM181,FALSE))","v":1599},1934.79,0,null,null,null,null,null,null,null,null,null,"Kč","L"]
[null,{"$f":"Calculation!C100+Calculation!C279","v":0},{"$f":"HLOOKUP(Main!$C$2,Translating_products!$CN$4:$DD$216,Translating_products!CM182, FALSE)","v":100237},{"$f":"HLOOKUP(Main!$C$2,Translating_products!$DI$4:$DY$216,Translating_products!CM182, FALSE)","v":"Příložný LED Spot Tree RGBW bílá"},{"$f":"IF(ISBLANK($Q$1),HLOOKUP(Main!$C$2,Translating_products!$EE$4:$EU$216,Translating_products!CM182,FALSE),HLOOKUP($Q$1,Translating_products!$EE$4:$EU$216,Translating_products!CM182,FALSE))","v":3199},3870.79,0,null,null,null,null,null,null,null,null,null,"Kč","L"]
[null,{"$f":"Calculation!C101+Calculation!C280","v":0},{"$f":"HLOOKUP(Main!$C$2,Translating_products!$CN$4:$DD$216,Translating_products!CM183, FALSE)","v":100238},{"$f":"HLOOKUP(Main!$C$2,Translating_products!$DI$4:$DY$216,Translating_products!CM183, FALSE)","v":"Příložný LED Spot Tree WW bílá"},{"$f":"IF(ISBLANK($Q$1),HLOOKUP(Main!$C$2,Translating_products!$EE$4:$EU$216,Translating_products!CM183,FALSE),HLOOKUP($Q$1,Translating_products!$EE$4:$EU$216,Translating_products!CM183,FALSE))","v":2699},3265.79,0,null,null,null,null,null,null,null,null,null,"Kč","L"]
[null,{"$f":"Calculation!C102+Calculation!C281","v":0},{"$f":"HLOOKUP(Main!$C$2,Translating_products!$CN$4:$DD$216,Translating_products!CM184, FALSE)","v":100268},{"$f":"HLOOKUP(Main!$C$2,Translating_products!$DI$4:$DY$216,Translating_products!CM184, FALSE)","v":"LED Spot Tree WW bílá"},{"$f":"IF(ISBLANK($Q$1),HLOOKUP(Main!$C$2,Translating_products!$EE$4:$EU$216,Translating_products!CM184,FALSE),HLOOKUP($Q$1,Translating_products!$EE$4:$EU$216,Translating_products!CM184,FALSE))","v":1599},1934.79,0,null,null,null,null,null,null,null,null,null,"Kč","L"]
[null,{"$f":"Calculation!C103+Calculation!C282","v":0},{"$f":"HLOOKUP(Main!$C$2,Translating_products!$CN$4:$DD$216,Translating_products!CM185, FALSE)","v":100269},{"$f":"HLOOKUP(Main!$C$2,Translating_products!$DI$4:$DY$216,Translating_products!CM185, FALSE)","v":"LED Spot Tree RGBW bílá"},{"$f":"IF(ISBLANK($Q$1),HLOOKUP(Main!$C$2,Translating_products!$EE$4:$EU$216,Translating_products!CM185,FALSE),HLOOKUP($Q$1,Translating_products!$EE$4:$EU$216,Translating_products!CM185,FALSE))","v":2149},{"$f":"E185*(1+$E$197*0.01)","v":2600.29},0,null,null,null,null,null,null,null,null,null,"Kč","L"]
[null,{"$f":"Calculation!C104+Calculation!C283","v":9},{"$f":"HLOOKUP(Main!$C$2,Translating_products!$CN$4:$DD$216,Translating_products!CM186, FALSE)","v":100239},{"$f":"HLOOKUP(Main!$C$2,Translating_products!$DI$4:$DY$216,Translating_products!CM186, FALSE)","v":"RGBW 24V Dimmer Tree"},{"$f":"IF(ISBLANK($Q$1),HLOOKUP(Main!$C$2,Translating_products!$EE$4:$EU$216,Translating_products!CM186,FALSE),HLOOKUP($Q$1,Translating_products!$EE$4:$EU$216,Translating_products!CM186,FALSE))","v":1599},1934.79,17413.11,null,null,null,null,null,null,null,null,null,"Kč","L"]
[null,{"$f":"Calculation!C259+Calculation!C197","v":0},{"$f":"HLOOKUP(Main!$C$2,Translating_products!$CN$4:$DD$216,Translating_products!CM189, FALSE)","v":100177},{"$f":"HLOOKUP(Main!$C$2,Translating_products!$DI$4:$DY$216,Translating_products!CM189, FALSE)","v":"Okenní klika Air"},{"$f":"IF(ISBLANK($Q$1),HLOOKUP(Main!$C$2,Translating_products!$EE$4:$EU$216,Translating_products!CM189,FALSE),HLOOKUP($Q$1,Translating_products!$EE$4:$EU$216,Translating_products!CM189,FALSE))","v":3249},3931.29,0,null,null,null,null,null,null,null,null,null,"Kč","R"]
[null,{"$f":"Calculation!C412","v":0},{"$f":"HLOOKUP(Main!$C$2,Translating_products!$CN$4:$DD$216,Translating_products!CM190, FALSE)","v":100283},{"$f":"HLOOKUP(Main!$C$2,Translating_products!$DI$4:$DY$216,Translating_products!CM190, FALSE)","v":"DI Extension"},{"$f":"IF(ISBLANK($Q$1),HLOOKUP(Main!$C$2,Translating_products!$EE$4:$EU$216,Translating_products!CM190,FALSE),HLOOKUP($Q$1,Translating_products!$EE$4:$EU$216,Translating_products!CM190,FALSE))","v":5999},7258.79,0,null,null,null,null,null,null,null,null,null,"Kč","R"]
[null,{"$f":"Calculation!C284+Calculation!C353+Calculation!C198","v":1},{"$f":"HLOOKUP(Main!$C$2,Translating_products!$CN$4:$DD$216,Translating_products!CM191, FALSE)","v":100246},{"$f":"HLOOKUP(Main!$C$2,Translating_products!$DI$4:$DY$216,Translating_products!CM191, FALSE)","v":"Meteostanice Tree"},{"$f":"IF(ISBLANK($Q$1),HLOOKUP(Main!$C$2,Translating_products!$EE$4:$EU$216,Translating_products!CM191,FALSE),HLOOKUP($Q$1,Translating_products!$EE$4:$EU$216,Translating_products!CM191,FALSE))","v":7199},{"$f":"E189*(1+$E$197*0.01)","v":8710.7899999999991},8710.7899999999991,null,null,null,null,null,null,null,null,null,"Kč"]
[null,{"$f":"Calculation!C354+Calculation!C260+Calculation!C199","v":0},{"$f":"HLOOKUP(Main!$C$2,Translating_products!$CN$4:$DD$216,Translating_products!CM192, FALSE)","v":100245},{"$f":"HLOOKUP(Main!$C$2,Translating_products!$DI$4:$DY$216,Translating_products!CM192, FALSE)","v":"Meteostanice Air"},{"$f":"IF(ISBLANK($Q$1),HLOOKUP(Main!$C$2,Translating_products!$EE$4:$EU$216,Translating_products!CM192,FALSE),HLOOKUP($Q$1,Translating_products!$EE$4:$EU$216,Translating_products!CM192,FALSE))","v":7999},9678.7899999999991,0,null,null,null,null,null,null,null,null,null,"Kč"]
[null,{"$f":"Calculation!C105","v":0},{"$f":"HLOOKUP(Main!$C$2,Translating_products!$CN$4:$DD$216,Translating_products!CM193, FALSE)","v":200311},{"$f":"HLOOKUP(Main!$C$2,Translating_products!$DI$4:$DY$216,Translating_products!CM193, FALSE)","v":"Krabice do betonu pro LED spot"},{"$f":"IF(ISBLANK($Q$1),HLOOKUP(Main!$C$2,Translating_products!$EE$4:$EU$216,Translating_products!CM193,FALSE),HLOOKUP($Q$1,Translating_products!$EE$4:$EU$216,Translating_products!CM193,FALSE))","v":599},724.79,0,null,null,null,null,null,null,null,null,null,"Kč"]
[null,{"$f":"Calculation!C355+Calculation!C261","v":0},{"$f":"HLOOKUP(Main!$C$2,Translating_products!$CN$4:$DD$216,Translating_products!CM194, FALSE)","v":100251},{"$f":"HLOOKUP(Main!$C$2,Translating_products!$DI$4:$DY$216,Translating_products!CM194, FALSE)","v":"Žaluziový pohon GJ56 Air 6Nm kabel nahoře"},{"$f":"IF(ISBLANK($Q$1),HLOOKUP(Main!$C$2,Translating_products!$EE$4:$EU$216,Translating_products!CM194,FALSE),HLOOKUP($Q$1,Translating_products!$EE$4:$EU$216,Translating_products!CM194,FALSE))","v":6499},7863.79,0,null,null,null,null,null,null,null,null,null,"Kč"]
[null,{"$f":"Calculation!C356+Calculation!C262","v":0},{"$f":"HLOOKUP(Main!$C$2,Translating_products!$CN$4:$DD$216,Translating_products!CM195, FALSE)","v":100252},{"$f":"HLOOKUP(Main!$C$2,Translating_products!$DI$4:$DY$216,Translating_products!CM195, FALSE)","v":"Žaluziový pohon GJ56 Air 20Nm kabel nahoře"},{"$f":"IF(ISBLANK($Q$1),HLOOKUP(Main!$C$2,Translating_products!$EE$4:$EU$216,Translating_products!CM195,FALSE),HLOOKUP($Q$1,Translating_products!$EE$4:$EU$216,Translating_products!CM195,FALSE))","v":7549},9134.2899999999991,0,null,null,null,null,null,null,null,null,null,"Kč"]
[null,{"$f":"Calculation!C357+Calculation!C263","v":0},{"$f":"HLOOKUP(Main!$C$2,Translating_products!$CN$4:$DD$216,Translating_products!CM196, FALSE)","v":100251},{"$f":"HLOOKUP(Main!$C$2,Translating_products!$DI$4:$DY$216,Translating_products!CM196, FALSE)","v":"Žaluziový pohon GJ56 Air 6Nm kabel dole"},{"$f":"IF(ISBLANK($Q$1),HLOOKUP(Main!$C$2,Translating_products!$EE$4:$EU$216,Translating_products!CM196,FALSE),HLOOKUP($Q$1,Translating_products!$EE$4:$EU$216,Translating_products!CM196,FALSE))","v":6499},7863.79,0,null,null,null,null,null,null,null,null,null,"Kč"]
[null,{"$f":"Calculation!C358+Calculation!C264","v":0},{"$f":"HLOOKUP(Main!$C$2,Translating_products!$CN$4:$DD$216,Translating_products!CM197, FALSE)","v":100252},{"$f":"HLOOKUP(Main!$C$2,Translating_products!$DI$4:$DY$216,Translating_products!CM197, FALSE)","v":"Žaluziový pohon GJ56 Air 20Nm kabel dole"},{"$f":"IF(ISBLANK($Q$1),HLOOKUP(Main!$C$2,Translating_products!$EE$4:$EU$216,Translating_products!CM197,FALSE),HLOOKUP($Q$1,Translating_products!$EE$4:$EU$216,Translating_products!CM197,FALSE))","v":7549},9134.2899999999991,0,null,null,null,null,null,null,null,null,null,"Kč"]
[null,null,null,{"$f":"VLOOKUP(Main!C2,Translating_general!A77:AF94,9,FALSE)","v":"Celkem bez DPH"},null,null,{"$f":"SUMPRODUCT(B7:B195,E7:E195)","v":285462.48},null,null,null,null,null,null,null,null,null,{"$f":"$Q$7","v":"Kč"}]
[null,null,null,{"$f":"VLOOKUP(Main!C2,Translating_general!A77:AF94,10,FALSE)","v":"+ DPH"},{"$f":"IF(ISBLANK($Q$1),VLOOKUP(Main!C2,Translating_general!A77:IH94,35,FALSE),VLOOKUP(Q1,Translating_general!A77:IH94,35,FALSE))","v":21},"%",{"$f":"G196*((E197/100))","v":59947.120799999997},null,null,null,null,null,null,null,null,null,{"$f":"$Q$7","v":"Kč"}]
[null,null,null,{"$f":"VLOOKUP(Main!C2,Translating_general!A77:AF94,11,FALSE)","v":"Celkem s DPH"},null,null,{"$f":"G196+G197","v":345409.60079999996},null,null,null,null,null,null,null,null,null,"Kč"]
[null,null,null,"*PLEASE NOTE*","Price 1.8.2017",null,{"$f":"G196*(1+R200)","v":293169.96695999993},null,null,null,null,null,null,null,null,null,"Kč","Price increase factor"]
[null,null,null,"There is a price increase from the 1st of August 2017 .",null,"with VAT",{"$f":"G196*(1+R200)*(1+(E197/100))","v":354735.66002159991},null,null,null,null,null,null,null,null,null,"Kč",{"$f":"IF(Q1 = \"CHE\", 0.027, IF(Main!C2=\"DE\",\"0,027\",IF(Main!C2=\"EN_UK\",0,IF(Main!C2=\"EN_US\",0,IF(Main!C2=\"FR\",0.027,IF(Main!C2=\"ES\",0.027,IF(Main!C2=\"CZ\",0.027,IF(Main!C2=\"IT\",0.027,IF(Main!C2=\"SK\",0.027,IF(Main!C2=\"NL\",0.027,0.027))))))))))","v":2.7E-2}]
[null,null,null,"(US is already considered)"]
[null,null,null,"(UK not considered)"]
[]
[null,null,{"$f":"VLOOKUP(Main!C2,Translating_general!A77:AF94,12,FALSE)","v":"Dostupné"},null,{"$f":"VLOOKUP(Main!C2,Translating_general!A77:AF94,13,FALSE)","v":"Potřebné"},{"$f":"VLOOKUP(Main!C2,Translating_general!A77:AF94,14,FALSE)","v":"Zbývající"}]
[null,null,{"$f":"Calculation!D53","v":4},{"$f":"VLOOKUP(Main!C2,Translating_general!A77:AF94,15,FALSE)","v":"Analogové vstupy"},{"$f":"Calculation!D54","v":1},{"$f":"Calculation!D55","v":3}]
[null,null,{"$f":"Calculation!E53","v":8},{"$f":"VLOOKUP(Main!C2,Translating_general!A77:AF94,16,FALSE)","v":"Digitální vstupy"},{"$f":"Calculation!E54","v":8},{"$f":"Calculation!E55","v":0}]
[null,null,{"$f":"Calculation!F53","v":4},{"$f":"VLOOKUP(Main!C2,Translating_general!A77:AF94,17,FALSE)","v":"Analogové výstupy"},{"$f":"Calculation!F54","v":0},{"$f":"Calculation!F55","v":4}]
[null,null,{"$f":"Calculation!G53","v":8},{"$f":"VLOOKUP(Main!C2,Translating_general!A77:AF94,18,FALSE)","v":"Digitální výstupy 5A"},{"$f":"Calculation!G54","v":8},{"$f":"Calculation!G55","v":0}]
[null,null,{"$f":"Calculation!H53","v":0},{"$f":"VLOOKUP(Main!C2,Translating_general!A77:AF94,19,FALSE)","v":"1-Wire zařízení"},{"$f":"Calculation!H54","v":0},{"$f":"Calculation!H55","v":0}]
[null,null,{"$f":"Calculation!I53","v":128},{"$f":"VLOOKUP(Main!C2,Translating_general!A77:AF94,20,FALSE)","v":"Air Base zařízení"},{"$f":"Calculation!I54","v":8},{"$f":"Calculation!I55","v":120}]
[null,null,{"$f":"Calculation!J53","v":0},{"$f":"VLOOKUP(Main!C2,Translating_general!A77:AF94,21,FALSE)","v":"EnOcean"},{"$f":"Calculation!J54","v":0},{"$f":"Calculation!J55","v":0}]
[null,null,{"$f":"Calculation!L53","v":28},{"$f":"VLOOKUP(Main!C2,Translating_general!A77:AF94,22,FALSE)","v":"Digitální výstupy 16A"},{"$f":"Calculation!L54","v":21},{"$f":"Calculation!L55","v":7}]
[null,null,{"$f":"Calculation!C79*4","v":0},{"$f":"VLOOKUP(Main!C2,Translating_general!A77:AF94,23,FALSE)","v":"Kanály Dimmeru"},{"$f":"Calculation!N79","v":0},{"$f":"C213-E213","v":0}]
[null,null,{"$f":"Calculation!O53","v":0},{"$f":"VLOOKUP(Main!C2,Translating_general!A101:AL118,38,FALSE)","v":"Dali Channels"},{"$f":"Calculation!O54","v":0},{"$f":"Calculation!O55","v":0}]
[null,null,{"$f":"Calculation!K45+Calculation!C269*Calculation!K72+Calculation!C409*Calculation!K72","v":100},{"$f":"VLOOKUP(Main!C2,Translating_general!A77:AH95,34,FALSE)","v":"Tree Channels"},{"$f":"Calculation!K43*(-1)+Calculation!C409*Calculation!K72","v":32},{"$f":"C215-E215","v":68}]
[]
[]
[null,null,null,{"$f":"VLOOKUP(Main!C2,Translating_general!A77:AF94,24,FALSE)","v":"Požadované místo v rozvaděči"}]
[null,null,null,{"$f":"VLOOKUP(Main!C2,Translating_general!A77:AF94,25,FALSE)","v":"v mm"},{"$f":"Space!I9","v":1201}]
[null,null,null,{"$f":"VLOOKUP(Main!C2,Translating_general!A77:AF94,26,FALSE)","v":"počet modulů"},{"$f":"Space!I10","v":70}]
[]
[null,null,null,{"$f":"VLOOKUP(Main!C2,Translating_general!A77:AF94,27,FALSE)","v":"Výpočet zdroje v Ampérech"}]
[null,null,null,null,{"$f":"VLOOKUP(Main!C2,Translating_general!A77:AF94,31,FALSE)","v":"Dostupné"},{"$f":"VLOOKUP(Main!C2,Translating_general!A77:AF94,32,FALSE)","v":"Potřebné"}]
[null,null,null,{"$f":"VLOOKUP(Main!C2,Translating_general!A77:AF94,28,FALSE)","v":"Extension"},{"$f":"Calculation!J423","v":1.3},{"$f":"Calculation!J424","v":0.73080000000000001}]
[null,null,null,{"$f":"VLOOKUP(Main!C2,Translating_general!A77:AF94,29,FALSE)","v":"LED"},{"$f":"Calculation!J439","v":24.2},{"$f":"Calculation!J440","v":21}]
[null,null,null,{"$f":"VLOOKUP(Main!C2,Translating_general!A77:AF94,30,FALSE)","v":"Příslušenství"},{"$f":"Calculation!J461","v":1.3},{"$f":"Calculation!J462","v":0.33760000000000001}]
[null,"Please note that all the prices might have changed!"]
[null,"This tool was degsigned to support you as good as possible, if there are any mistakes in calculation please inform us! support@loxone.com"]

{"sheet":"Datanorm","index":19,"n_rows":0,"n_cols":0,"rows_kept":0,"cut":false,"hidden":true,"merged":[]}

{"sheet":"Sample Quote","index":20,"n_rows":196,"n_cols":6,"rows_kept":196,"cut":false,"hidden":true,"merged":[[133,1,133,8],[94,5,94,9],[97,5,97,9],[100,5,100,9],[76,1,85,8],[132,1,132,8],[131,1,131,8],[115,1,115,5],[119,1,119,5],[123,1,123,5],[193,2,193,3],[194,2,194,3],[138,1,138,8],[139,1,139,8],[144,1,144,8],[149,1,149,8],[188,2,188,3],[189,2,189,3],[190,2,190,3],[191,2,191,3],[192,2,192,3]]}
[]
[]
[]
[]
[]
[]
[]
[]
[]
[]
[]
[]
[]
[]
[null,"Loxone Smart Home Angebot"]
[]
[]
[]
[null,"Projekt"]
[null,"Kunde"]
[null,"Adresse"]
[null,"PLZ"]
[null,"Ort"]
[]
[]
[]
[]
[]
[]
[]
[]
[]
[]
[]
[]
[]
[]
[]
[]
[]
[]
[]
[]
[]
[]
[]
[]
[]
[]
[]
[]
[]
[]
[]
[]
[]
[]
[]
[]
[]
[]
[]
[]
[]
[]
[]
[]
[]
[]
[]
[]
[]
[]
[]
[null,"Loxone Leistungsbeschreibung"]
[]
[null,"Im Folgenden finden Sie eine Beschreibung der technischen Umsetzung Ihres Loxone Smart Homes. Die Leistungsbeschreibung enthält die Basisausstattung mit allen Komponenten die wir für ein Loxone Smart Home empfehlen. Damit können Sie Beleuchtung, Beschattung, Heizung, Alarm und mehr steuern. In dem Angebot enthalten ist die Verkabelung, Installation sowie die Konfiguration Ihres Loxone Smart Homes. In den Preisen sind Hardware, Verkabelung, Installation sowie Konfigurierung enthalten, ebenso sind die Apps zur Bedienung Ihres Loxone Smart Homes kostenlos im Google Play Store sowie Apple App Store erhältlich.  "]
[]
[]
[]
[]
[]
[]
[]
[]
[]
[]
[]
[]
[]
[]
[null,"Smartes Bedienen mit dem Loxone Tastenstandard"]
[]
[null,null,null,null,null,"Mitte"]
[null,null,null,null,null,"Ein Klick, Licht an. Mit jedem weiteren Klick schalten Sie Ihre vordefinierten Szenen durch. Doppelklick: Alles aus im Raum. Nicht nur die Beleuchtung schalten Sie mit dem Doppelklick aus, auch Verbraucher oder die Musik wird somit ausgeschaltet. Dreifachklick: “Alles aus” im Smart Home."]
[]
[null,null,null,null,null,"Links oben/unten"]
[null,null,null,null,null,"Das Smart Home übernimmt für Sie die Beschattung. Möchten Sie eingreifen, reicht ein Klick auf die Jalousietasten und die Beschattung fährt nach Ihrer Definition."]
[]
[null,null,null,null,null,"Rechts oben/unten"]
[null,null,null,null,null,"Ein Klick: Musik an. Doppelklick: Die Musikquelle wird gewechselt. Ein Klick, die Musik wird leiser. Doppelklick: Die Musik im Raum wird deaktiviert."]
[]
[]
[]
[]
[]
[]
[]
[]
[]
[]
[]
[]
[]
[]
[]
[]
[]
[]
[]
[]
[]
[]
[]
[]
[]
[]
[null,"Allgemeine Beschreibung"]
[]
[null,"Beleuchtung"]
[]
[null,"Automatisiertes Grundlicht , Szenen Bedienung über einen der Loxone Haupt-Tastpunkte oder der Remote Air Fernbedienung. Raum-Aus-Funktion über Doppelklick auf Szenen Taste."]
[null,"Somit “Kein Vergessen mehr”, das Licht auszuschalten. Befindet sich länger als eine Stunde niemand im Raum, wird automatisch die Beleuchtung deaktiviert."]
[null,"Lichtszenen können über die Visualisierung verändert, ergänzt und gespeichert werden."]
[]
[]
[null,"Beschattung"]
[]
[null,"Die Beschattung regelt sich automatisch anhand der Innenraumtemperatur sowie des Sonnenstands."]
[null,"Zentrale Bedienung im Raum der Beschattung über einen der Loxone Haupt-Tastpunkte (Auf/Ab). Beschattungselemente werden bei erhöhter Windgeschwindigkeit automatisch in Sicherheitsposition gefahren. Beschattung wird bei Morgendämmerung automatisch geöffnet und bei Abenddämmerung wieder automatisch geschlossen. Jedes Beschattungselement kann über die Visualisierung einzeln bedient werden. Bei geöffneter Terrassentür wird die Automatik deaktiviert und die Beschattung hochgefahren. "]
[]
[]
[null,"Heizung"]
[]
[null,"Die Temperatur kann auf Raumebene individuell eingestellt werden. Über die Visualisierung können die Komforttemperaturen sowie Heizzeiten/Kühlzeiten individuell angepasst werden.\nGeöffnete Fenster werden über einen Integrierten Kontakt berücksichtigt und die Temperatur wird automatisch auf Frostschutz Temperatur im Winter und Hitzeschutz Temperatur im Sommer geregelt. Weiters wird bei Anwesenheit die Komforttemperatur für 1 Stunde verlängert.\n"]
[]
[]
[null,"Musik"]
[]
[null,"Ihre Lieblingsmusik können Sie mit Loxone in jeder Musik Zone perfekt integrieren \nund bequem per App oder den Haupt-Tastpunkten bedient werden. \nEin/Aus, Lautstärke sowie Quellen können bequem von den Loxone Haupt-Tastpunkten oder der Remote Air Fernbedienung bedient werden."]
[]
[]
[]
[]
[]
[]
[]
[]
[]
[]
[]
[]
[]
[]
[]
[null,"Raumliste"]
[]
[null,"Raum","Licht","Beschattung","Heizung ","Musik"]
[]
[]
[]
[]
[]
[]
[]
[]
[]
[]
[]
[]
[]
[]
[]
[]
[]
[]
[]
[]
[]
[]
[null,"Licht",{"$f":"QuickPlanning2!D43","v":60104}]
[null,"Beschattung",{"$f":"QuickPlanning2!D45","v":0}]
[null,"Heizung",{"$f":"QuickPlanning2!D47","v":10494}]
[null,"Musik",{"$f":"QuickPlanning2!D49","v":52993}]
[null,"Gesamt netto",{"$f":"SUM(C190:C194)+C189","v":123591}]
[null,"Gesamt brutto",null,{"$f":"C195*(1+Products!E197/100)","v":149545.10999999999}]

{"sheet":"News","index":21,"n_rows":38,"n_cols":13,"rows_kept":38,"cut":false,"hidden":false,"merged":[[3,11,25,11],[6,12,7,15],[8,12,9,15],[10,12,11,15],[12,12,13,15],[14,12,15,15],[16,12,17,15],[18,12,19,15],[20,12,21,15],[22,12,23,15],[24,12,25,15],[3,12,5,15],[3,6,25,6],[6,7,7,10],[8,7,9,10],[10,7,11,10],[12,7,13,10],[18,7,19,10],[20,7,21,10],[22,7,23,10],[24,7,25,10],[3,7,5,10],[14,7,17,10],[0,0,2,0],[3,0,25,0],[3,2,5,5],[6,2,7,5],[8,2,9,5],[10,2,11,5],[12,2,13,5],[14,2,15,5],[16,2,17,5],[18,2,19,5],[20,2,21,5],[22,2,23,5],[24,2,25,5],[26,2,28,5],[26,6,48,6],[26,7,28,10],[26,11,48,11],[26,12,28,15],[29,2,30,5],[29,7,30,10],[29,12,30,15],[31,2,32,5],[31,7,32,10],[31,12,32,15],[33,2,34,5],[33,7,34,10],[33,12,34,15],[35,2,36,5],[35,7,36,10],[35,12,36,15],[37,2,38,5],[37,7,40,10],[37,12,38,15],[39,2,40,5],[39,12,40,15],[41,2,42,5],[41,7,42,10],[41,12,42,15],[43,2,44,5],[43,7,44,10],[43,12,44,15],[45,2,46,5],[45,7,46,10],[45,12,46,15],[47,2,48,5],[47,7,48,10],[47,12,48,15]]}
["current version 2.8.7"]
["Version"]
["2_8_5"]
[null,null,"Changes at 2.8.4",null,null,null,null,"Changes at 2.8.5",null,null,null,null,"Changes at 2.8.6"]
[]
[]
[null,null,"  - Nano DI Tree added",null,null,null,null,"  - Change log (NEWS) added into the Tool",null,null,null,null,"- Bug fixed when only a 1-wire reader was added (there was no Miniserver)"]
[]
[null,null,"  - thermal valve actuator 0-10V deleted ",null,null,null,null,"  - added Light circuit 5-16A in light category",null,null,null,null,"- Some missing translations were added"]
[]
[null,null,"  - Analog In (Reserve) added in sensor category",null,null,null,null,"  - added coupling relay to distribution category",null,null,null,null,"- Bug fixed, Air device channels from cathegory \"Sensors\" were not counted"]
[]
[null,null,"  - Feller Adapter Set added in CHE",null,null,null,null,"  - corrected price of weather service 10 years",null,null,null,null," - Window handle Air added"]
[]
[null,null,"  - adjusted international prices ",null,null,null,null," - new products added (Touch Pure anthracite, RGBW Dimmer Tree, new Spots)",null,null,null,null," - 2.8.6.'PRICE Window handle air + dimmer tree was not counted - fixed"]
[]
[]
[]
[null,null,null,null,null,null,null," - a few issues with blank cells were corrected"]
[]
[]
[]
[]
[]
[]
[]
[null,null,"Changes at 2.8.7",null,null,null,null,"Changes at 2.8.8"]
[]
[]
[null,null,"  - After a change at the main mage, the products will now actualize automatically",null,null,null,null,"  - new products added (weather station, shutter motor, spot backbox)"]
[]
[null,null," - New Products addes (DI Extension)"]
[]
[null,null," - Main page: Reset button added to clear the hole sheet"]
[]
[null,null," - RGBW Dimmer 24V Tree Price corrected for Switzerland"]
[]
[null,null," - Once the tool is opened a message box will ask about the  language"]

{"sheet":"Translating_general","index":22,"n_rows":164,"n_cols":39,"rows_kept":164,"cut":false,"hidden":true,"merged":[[1,0,1,14]]}
[]
["General Translating of the \"Eingabe\", \"Stückliste\", \"Netzteilrechner\"; \"Platzbedarfsrechner\" sheets => Normally you do this translation just once, Translating_products has to be updated constantly"]
[]
["Main"]
["DE","Stückzahl","Raumteilung","Licht","Beschattung","Heizung","Sensor","Air","Taster","Zutritt","Musik","Miniserver&Extension","Verteiler","Zubehör","Fans&Partner","Tree","Drop-Down-Menü Auswahl","Eingabe","Tree"]
["EN_UK","Quantity","Rooms","Lighting","Shading","Heating","Sensor","Air","Switches","Access","Music","Miniserver & Extension","Cabinet","Other","Fans & Partner","Tree","Drop Down Selection","Configuration","Tree"]
["EN_US","Quantity","Rooms","Light","Shading","Heating","Sensor","Air","Push-Buttons","Access","Music","Miniserver&Extension","Cabinet","Other","Fans&Partner","Tree","Drop Down Selection","Configuration","Tree"]
["FR","Quantité","Pièces","Eclairage","Ouvrants","Chauffage","Capteurs","Air","Boutons Poussoirs","Acccès","Audio","Miniserver&Extension","Tableau","Alimentations","Fans&Partenaires","Tree","Menu déroulant","Configuration","Tree"]
["ES","Número de unidades","Habitaciones","Iluminación","Sombreado","Climatización","Sensores","Air","Pulsadores","Acceso","Música","Miniserver y Extensiones","Conexión","Accesorios","Fans&Partner","Tree","Seleccinar del desplegable","Configuración","Tree"]
["CZ","Počet","Místnosti","Světlo","Stínění","Topení","Sensor","Air","Tlačítka","Přístup","Hudba","Miniserver&Extension","Rozvaděč","Příslušenství","Fanoušci a Partneři","Tree","Rozbalovací menu","Vyplňte","Tree"]
["IT","Quantità","Stanze","Illuminazione","Ombreggiatura","Riscaldamento","Sensori","Air","Pulsanti","Accesso","Musica","Miniserver & Extension","Distributore","Accessori","Fans & Partner","Tree","Scelta a menu drop-down","Immissione","Tree"]
["CHE","not translated yet","not translated yet","not translated yet","not translated yet","not translated yet","not translated yet","not translated yet","not translated yet","not translated yet","not translated yet","not translated yet","not translated yet","not translated yet","not translated yet","not translated yet","not translated yet","not translated yet","Tree"]
["SK","Počet","Místnosti","Světlo","Stínění","Topení","Sensor","Air","Tlačítka","Přístup","Hudba","Miniserver&Extension","Rozvaděč","Příslušenství","Fanoušci a Partneři","Tree","Rozbalovací menu","Vyplňte","Tree"]
["NL","Hoeveelheid","Ruimtes","Licht","Beschaduwing","Verwarming","Sensor","Air","Drukknoppen","Toegang","Muziek","Miniserver&Extension","Verdeelbord","Toebehoren","Fans&Partner","Tree","Drop-Down menu","Configuratie","Tree"]
["FI","not translated yet","not translated yet","not translated yet","not translated yet","not translated yet","not translated yet","not translated yet","not translated yet","not translated yet","not translated yet","not translated yet","not translated yet","not translated yet","not translated yet","not translated yet","not translated yet","not translated yet","Tree"]
["HU","not translated yet","not translated yet","not translated yet","not translated yet","not translated yet","not translated yet","not translated yet","not translated yet","not translated yet","not translated yet","not translated yet","not translated yet","not translated yet","not translated yet","not translated yet","not translated yet","not translated yet","Tree"]
["IE","not translated yet","not translated yet","not translated yet","not translated yet","not translated yet","not translated yet","not translated yet","not translated yet","not translated yet","not translated yet","not translated yet","not translated yet","not translated yet","not translated yet","not translated yet","not translated yet","not translated yet","Tree"]
["reservated",null,null,null,null,null,null,null,null,null,null,null,null,null,null,null,null,null,"to translate"]
["reservated",null,null,null,null,null,null,null,null,null,null,null,null,null,null,null,null,null,"to translate"]
["reservated",null,null,null,null,null,null,null,null,null,null,null,null,null,null,null,null,null,"to translate"]
["reservated",null,null,null,null,null,null,null,null,null,null,null,null,null,null,null,null,null,"to translate"]
["reservated",null,null,null,null,null,null,null,null,null,null,null,null,null,null,null,null,null,"to translate"]
[]
[]
[]
[]
[]
["Power"]
["DE","Netzteilrechner","Netzteile","Extensions","Artikelnummer","Produkte","Stück","Ampere/Stück","Gesamt","Ampere verfügbar","Ampere benötigt","Summe","LED","Peripherie","0,4 Ampere Netzteil/Stück"]
["EN_UK","Power Supply Calculator","Power Supplies","Extensions","Item number","Products","Quantity","Ampere/item","Total","Ampere available","Ampere needed","Total","LED","Periphery","0,4 Ampere Power Supply / item"]
["EN_US","Power Supply Calculator","Power Supplies","Extensions","Item number","Products","Quantity","Ampere/item","Total","Ampere available","Ampere needed","Total","LED","Periphery","0,4 Ampere Power Supply / item"]
["FR","Calcul d'Alimentation","Alimentation","Extensions","Référence","Produits","Quantité","Ampère/produit","Total","Ampère disponible","Ampère nécessaire","Total","LED","Periphérique","0,4 Ampère / produits"]
["ES","Calculadora de fuentes de alimentación","Fuentes de alimentación","Extensiones","Núm. de artículo","Productos","Unidades","Amperios/Ud.","Total","Amperios disponibles","Amperios necesarios","Total","LED","Periferia","0,4 Amperios F. Alimentación/Ud."]
["CZ","Výpočet zdroje","Zdroje","Extensiony","Číslo produktu","Produkty","Počet","Ampér/jednotku","Celkem","Zbývající Ampéry","Potřebné Ampéry","Celkem","LED","Příslušenství","0,4 Ampérový zdroj / jednotka"]
["IT","Calcolatore alimentatore","Alimentatori","Extensions","numero articolo","Prodotti","Pezzi","Ampere/pezzo","Totale","Ampere disponibile","Ampere necessita","Totale","LED","Periferia","0,4 Ampere alimentatore/pz"]
["CHE","Netzteilrechner","Netzteile","Extensions","Artikelnummer","Produkte","Stück","Ampere/Stück","Gesamt","Ampere verfügbar","Ampere benötigt","Summe","LED","Peripherie","0,4 Ampere Netzteil/Stück"]
["SK","Výpočet zdroje","Zdroje","Extensiony","Číslo produktu","Produkty","Počet","Ampér/jednotku","Celkem","Zbývající Ampéry","Potřebné Ampéry","Celkem","LED","Příslušenství","0,4 Ampérový zdroj / jednotka"]
["NL","Voeding calculator","Voeding","Extentions","Artikelnummer","Producten","Stuk","Ampère/Stuk","Totaal","Ampère beschikbaar","Ampère vereist","Totaal","LED","Toebehoren","0,4 Ampère Voeding / stuk"]
["FI","not translated yet","not translated yet","not translated yet","not translated yet","not translated yet","not translated yet","not translated yet","not translated yet","not translated yet","not translated yet","not translated yet","not translated yet","not translated yet","not translated yet"]
["HU","not translated yet","not translated yet","not translated yet","not translated yet","not translated yet","not translated yet","not translated yet","not translated yet","not translated yet","not translated yet","not translated yet","not translated yet","not translated yet","not translated yet"]
["IE","not translated yet","not translated yet","not translated yet","not translated yet","not translated yet","not translated yet","not translated yet","not translated yet","not translated yet","not translated yet","not translated yet","not translated yet","not translated yet","not translated yet"]
["reservated"]
["reservated"]
["reservated"]
["reservated"]
["reservated"]
[]
[]
[]
[]
[]
["Space"]
["DE","Platzbedarfsrechner","Artikelnummer","Produkte","Stück","Platzbedarf","Gesamt","Platzbedarf gesamt","Platzbedarf in mm","Platzbedarf in Teilungseinheiten"]
["EN_UK","Required Space Calculator","Item Numer","Products","Quantity","Required Space","Total","Total Space","Required Space in mm","Required Space in splitting units"]
["EN_US","Required Space Calculator","Item Numer","Products","Quantity","Required Space","Total","Total Space","Required Space in mm","Required Space in splitting units"]
["FR","Calcul Place Tableau","Référence","Produits","Quantité","Place nécessaire","Total","Place totale","Place nécessaire en mm","Place nécessaire en unité"]
["ES","Dimensionamiento","Nº de Arículo","Productos","Unidades","Espacio requerido","Total","Espacio necesario","Espacio necesario en mm","Espacio necesario en unidades DIN"]
["CZ","Výpočet požadovaného místa v rozvaděči","Číslo produktu","Produkty","Počet","Požadované místo","Celkem","Celkem místa","Požadované místo v mm","Počet modulů v rozvaděči"]
["IT","Calcolatore spazio","numero articolo","Prodotti","Pezzi","Spazio richiesto","Totale","Spazio totale","Spazio in mm","Spazio in unità di divisione"]
["CHE","not translated yet","not translated yet","not translated yet","not translated yet","not translated yet","not translated yet","not translated yet","not translated yet","not translated yet"]
["SK","Výpočet požadovaného místa v rozvaděči","Číslo produktu","Produkty","Počet","Požadované místo","Celkem","Celkem místa","Požadované místo v mm","Počet modulů v rozvaděči"]
["NL","Benodigde Ruimte Calculator","Artikelnummer","Producten","Stuk","Benodigde Ruimte","Totaal","Totale Ruimte","Benodigde Ruimte in mm","Benodigde Ruimte in Modules"]
["FI","not translated yet","not translated yet","not translated yet","not translated yet","not translated yet","not translated yet","not translated yet","not translated yet","not translated yet"]
["HU","not translated yet","not translated yet","not translated yet","not translated yet","not translated yet","not translated yet","not translated yet","not translated yet","not translated yet"]
["IE","not translated yet","not translated yet","not translated yet","not translated yet","not translated yet","not translated yet","not translated yet","not translated yet","not translated yet"]
["reservated"]
["reservated"]
["reservated"]
["reservated"]
["reservated"]
[]
[]
[]
[]
[]
["Products (general)",null,null,null,null,null,null,null,null,"set an ' otherwise excel thinks + is a function",null,null,null,null,null,null,null,null,null,null,null,null,null,null,null,null,null,null,null,null,null,null,"currency/Währung",null,"VAT in %",null,"do a '  before the minus otherwise it coutns as a forumula"]
["DE","Stückliste","Stück","Nr.","Beschreibung","Stück Netto","Stück Brutto","Gesamt","Gesamtpreis exkl. Steuern","+ Steuern","Gesamtpreis inkl. Steuern","Verfügbar","Benötigt","Reserve","Analoge Eingänge","Digitale Eingänge","Analoge Ausgänge","Digitale Ausgänge 5A","1-Wire Kanal","Air Base Kanäle","EnOcean","Digitale Ausgänge 16A","Dimmkanäle","Platzbedarf im Verteiler","in mm","in Teilungseinheiten","Netzteilrechner in Ampere","Extension","LED","Peripherie","Verfügbar","Bedarf","€","Treekanäle",20,"DE","Rabatt","Rabattierter Betrag"]
["EN_UK","Parts List","Quantity","No.","Description","Unit Net","Unit Gross","Total","Total excl. VAT","+ VAT","Total incl. VAT","Available","Required","Spare","Analogue Inputs","Digital Inputs","Analogue Outputs","Digital Outputs 5A","1-Wire Channel","Air Base Channels","EnOcean","Digital Outputs 16A","Dimmer Channels","Space Requirement Cabinett","in mm","in breaker units","Power Supply Calc. In Amps","Extension","LED","Peripherals","Available","Requried","£","Tree Channels",20,"EN_UK","Discount","Discounted Price"]
["EN_US","Parts List","Quantity","Nr.","Description","Unit Net","Unit Gross","Total","Total without taxes","+ Taxes","Total with taxes","Available","Needed","Left","Analog Inputs","Digital Inputs","Analog Outputs","Digital Outputs 5A","1-Wire Channel","Air Base Channels","Not available in this country","Digital Outputs 16A","Dimmer Channels","Space Requirement Cabinett","in mm","in splitting units","Powersupply Calc. In Ampere","Extension","LED","Periphery","Available","Needed","$","Tree Channels",null,"EN_US","Discount","Discounted Price"]
["FR","Liste de produits","Quantité","N°","Description","Pièce Net","Pièce Brut","Total","Total HT","+TVA","Total TTC","Disponible","Nécessaire","Restant","Entrées analogiques","Entrées numériques","Sorties analogiques","Sorties numériques 5A","canal 1-wire","canal Air Base","EnOcean","Sorties numériques 16A","Canal Dimmer","Espace nécessaire Tableau","en mm","en unité U","Calc Alimentation en Ampère","Extension","LED","Périphérique","Disponible","Nécessaire","€","Tree Channels",20,"FR","Discount","Discounted Price"]
["ES","Lista de productos","Unidades","Nº","Descripción","Precio sin IVA","Precio con IVA","Total","Precio total IVA no incluido","+ IVA","Precio total IVA incluido","Disponible","Necesario","Reserva","Entradas analógicas","Entradas digitales","Salidas analógicas","Salidas digitales 5A","Canales 1-Wire","Canales Air Base","EnoCean","Salidas digitales 16A","Canales dimmer","Espacio necesario en armario","en mm","En unidades de carril DIN","Calculadora de Fuentes de Alimentación (A)","Extensión","LED","Periferia","Disponible","Necesario","€","Canales Tree",21,"ES","Discount","Discounted Price"]
["CZ","Seznam produktů","Počet","č.","Popis","Cena za kus bez DPH","Cena za kus s DPH","Celkem","Celkem bez DPH","+ DPH","Celkem s DPH","Dostupné","Potřebné","Zbývající","Analogové vstupy","Digitální vstupy","Analogové výstupy","Digitální výstupy 5A","1-Wire zařízení","Air Base zařízení","EnOcean","Digitální výstupy 16A","Kanály Dimmeru","Požadované místo v rozvaděči","v mm","počet modulů","Výpočet zdroje v Ampérech","Extension","LED","Příslušenství","Dostupné","Potřebné","Kč","Tree Channels",21,"CZ","Discount","Discounted Price"]
["IT","Distinta","Pezzi","Nr.","Descrizione","Pezzo senza IVA","Pezzo con IVA","Totale","Prezzo totale senza IVA","+ IVA","Prezzo totale con IVA","Disponibile","Necessita","Riserva","Ingressi analogici","Ingressi digitali","Uscite analogiche","Uscite digitali 5A","Canale 1-Wire","Canali Air Base","EnOcean","Uscite digitali 16A","Canali dimmerabili","Spazio nel distributore","in mm","in unità di divisione","Calcolatore alimentatore in Ampere","Extension","LED","Periferia","Disponibile","Necessita","€","Canali Tree",22,"IT","Sconto","Importo senza sconto"]
["CHE","not translated yet","not translated yet","not translated yet","not translated yet","not translated yet","not translated yet","not translated yet","not translated yet","+ not translated yet","not translated yet","not translated yet","not translated yet","not translated yet","not translated yet","not translated yet","not translated yet","not translated yet","not translated yet","not translated yet","not translated yet","not translated yet","not translated yet","not translated yet","not translated yet","not translated yet","not translated yet","not translated yet","not translated yet","not translated yet","not translated yet","not translated yet","CHF","Tree Channels",8,"CHE","Discount","Discounted Price"]
["SK","Seznam produktů","Počet","č.","Popis","Cena za kus bez DPH","Cena za kus s DPH","Celkem","Celkem bez DPH","+ DPH","Celkem s DPH","Dostupné","Potřebné","Zbývající","Analogové vstupy","Digitální vstupy","Analogové výstupy","Digitální výstupy 5A","1-Wire zařízení","Air Base zařízení","EnOcean","Digitální výstupy 16A","Kanály Dimmeru","Požadované místo v rozvaděči","v mm","počet modulů","Výpočet zdroje v Ampérech","Extension","LED","Příslušenství","Dostupné","Potřebné","€","Tree Channels",20,"SK","Discount","Discounted Price"]
["NL","Onderdelenlijst","Aantal","Nr.","Omschrijving","Stuk Netto","Stuk Brutto","Totaal","to translate","+ BTW","Totaal met BTW","Beschikbaar","Benodigd","Reserve","Analoge Ingang","Digitale Ingang","Analoge Uitgang","Digitale Uitgang 5A","1-Wire Kanaal","Air Base Kanaal","EnoCean","Digitale Uitgang 16A","Dimmer Kanalen","Benodigde Ruimte in Verdeelbord","in mm","In Modules","Voeding Calculator in Ampère","Extension","LED","Toebehoren","Beschikbaar","Benodigd","€","Tree Channels",21,"NL","Discount","Discounted Price"]
["FI","not translated yet","not translated yet","not translated yet","not translated yet","not translated yet","not translated yet","not translated yet","not translated yet","not translated yet","not translated yet","not translated yet","not translated yet","not translated yet","not translated yet","not translated yet","not translated yet","not translated yet","not translated yet","not translated yet","not translated yet","not translated yet","not translated yet","not translated yet","not translated yet","not translated yet","not translated yet","not translated yet","not translated yet","not translated yet","not translated yet","not translated yet","not translated yet","Tree Channels",24,"FI","Discount","Discounted Price"]
["HU","not translated yet","not translated yet","not translated yet","not translated yet","not translated yet","not translated yet","not translated yet","not translated yet","not translated yet","not translated yet","not translated yet","not translated yet","not translated yet","not translated yet","not translated yet","not translated yet","not translated yet","not translated yet","not translated yet","not translated yet","not translated yet","not translated yet","not translated yet","not translated yet","not translated yet","not translated yet","not translated yet","not translated yet","not translated yet","not translated yet","not translated yet","not translated yet","Tree Channels",27,"HU","Discount","Discounted Price"]
["IE","not translated yet","not translated yet","not translated yet","not translated yet","not translated yet","not translated yet","not translated yet","not translated yet","not translated yet","not translated yet","not translated yet","not translated yet","not translated yet","not translated yet","not translated yet","not translated yet","not translated yet","not translated yet","not translated yet","not translated yet","not translated yet","not translated yet","not translated yet","not translated yet","not translated yet","not translated yet","not translated yet","not translated yet","not translated yet","not translated yet","not translated yet","not translated yet","Tree Channels",23,"IE","Discount","Discounted Price"]
["reservated",null,null,null,null,null,null,null,null,"to translate","to translate","to translate","to translate","to translate","to translate","to translate","to translate","to translate","to translate","to translate","to translate","to translate","to translate","to translate","to translate","to translate","to translate","to translate","to translate","to translate","to translate","to translate","to change","Tree Channels"]
["reservated",null,null,null,null,null,null,null,null,"to translate","to translate","to translate","to translate","to translate","to translate","to translate","to translate","to translate","to translate","to translate","to translate","to translate","to translate","to translate","to translate","to translate","to translate","to translate","to translate","to translate","to translate","to translate","to change","Tree Channels"]
["reservated",null,null,null,null,null,null,null,null,"to translate","to translate","to translate","to translate","to translate","to translate","to translate","to translate","to translate","to translate","to translate","to translate","to translate","to translate","to translate","to translate","to translate","to translate","to translate","to translate","to translate","to translate","to translate","to change","Tree Channels"]
["reservated",null,null,null,null,null,null,null,null,"to translate","to translate","to translate","to translate","to translate","to translate","to translate","to translate","to translate","to translate","to translate","to translate","to translate","to translate","to translate","to translate","to translate","to translate","to translate","to translate","to translate","to translate","to translate","to change","Tree Channels"]
["reservated",null,null,null,null,null,null,null,null,"to translate","to translate","to translate","to translate","to translate","to translate","to translate","to translate","to translate","to translate","to translate","to translate","to translate","to translate","to translate","to translate","to translate","to translate","to translate","to translate","to translate","to translate","to translate","to change","Tree Channels"]
[]
[]
[]
[]
[]
["Drop down (hidden pages)",null,null,null,null,null,null,null,null,null,null,null,null,null,null,"Just for inputs, not the real hardware"]
["DE","Dimmer Extension [Kanalauswahl]","Analog 1-10V","Lichtkreis schaltbar 5A/Verbraucher 5A","Lichtkreis dimmbar 230V","Lichtkreis Dimmbar 0-10V EVG","DMX Dimmkanal 50W","Air Dimmkanal 50W","1-Wire Temperaturfühler","Windsensor 24V (ben. Extension mit DI)","Fensterkontakt (im Fenster integriert; DI)","Verbraucher 5A","Verbraucher 5-16A","Beschattung (Rollo, Raffstore,...)",null,"Taster 1fach Digital","Taster 2fach Digital","Taster 4fach Digital","Taster 5fach Digital","Musikserver Zonenauswahl","Trennwand P-Reihe (10 Stk.)","Bezeichnungsträger P-Reihe (20 Stk.)","Abschlussplatte P-Reihe (10 Stk.)","Jalousie Anschlussklemme PMAK4 (50 Stk.)","Abschlussplatte PMAK4 (20 Stk.)","Installations- Reihenklemme PDL (50 Stk.)","Endwinkel ZEW 35 (20 Stk.)","Abschlussplatte PDL (20 Stk.)","Sicherungs-Reihenklemme (25 Stk.)","Abschlussplatte Sicherungskl. (50 Stk.) ","Querverbinder 24 Polig (10 Stk.)","Sicherung 2A (100 Stk.)","Sicherung 5A (100 Stk.)","Sicherung 10A (100 Stk.)","Loxone CAT7 Kabel (250m)",null,"Dali Kanal","Dali Kanäle","Verbraucher 16A"]
["EN_UK","Dimmer Channel (230V)","Analogue 1-10V","Light Circut (switched )","Light Circuit (dimmed 230V)","Light Circuit (dimmed 0-10V)","Light Circuit (24V 50W DMX)","Light Circuit (24V 50W Air)","1-Wire Temperature Sensor","Windsensor 24V","Window Contact (integrated - only reserve DI)","Other Load (5A)","Other Load (5-16A)","Shading (Blinds, Curtains, …)","to translate","Retractive  Switch 1 Button (reserve 1 DI)","Retractive  Switch 2 Buttons (reserve 2 DI)","Retractive  Switch 4 Buttons (reserve 4 DI)","Retractive  Switch 5 Buttons (reserve 5 DI)","Music Server Zone","Partition for 8x4 Terminals (10pcs)","Label Holder 8 Levels (20 pcs)","End Plate for 8x4 Terminals (10 pcs)","Push In Terminal Block 3+Earth (50 pcs)","End Plate for 3+Earth Terminals (20 pcs)","Push In Terminal Block Twin+Earth (50 pcs)","End Bracket (20 pcs)","End Plate for Twin+Earth Terminals (20 pcs)","Push in Fused Terminal Block (25 pcs)","End Plate For Fused Terminals (50 pcs)","Cross Connector For Fused Terminals (10 pcs)","Blade Fuse 2A (100 pcs)","Blade Fuse 5A (100 pcs)","Blade Fuse 10A (100 pcs)","Loxone CAT7 Cable (250m)","to translate","Dali Channel","Dali Channels","Circut (switched ) 16A"]
["EN_US","Dimmer Channel (110V)","Analogue 1-10V","Light Circut (switched )","Light Circuit (dimmed 110V)","Light Circuit (dimmed 0-10V)","Light Circuit (24V 50W DMX)","Light Circuit (24V 50W Air)","1-Wire Temperature Sensor","Windsensor 24V","Window Contact (integrated - only reserve DI)","Other Load (5A)","Other Load (5-16A)","Shading (Blinds, Curtains, …)","to translate","Retractive Wattstoper 1 Push button (reserve 1 DI)","Retractive  Wattstoper 2 Push buttons (reserve 2 DI)","Retractive  Wattstoper 4 Push buttons (reserve 4 DI)","Retractive  Wattstoper 5 Push buttons (reserve 5 DI)","Music Server Zone","Partition for 8x4 Terminals (10pcs)","Label Holder 8 Levels (20 pcs)","End Plate for 8x4 Terminals (10 pcs)","Push In Terminal Block 3+Earth (50 pcs)","End Plate for 3+Earth Terminals (20 pcs)","Push In Terminal Block Twin+Earth (50 pcs)","End Bracket (20 pcs)","End Plate for Twin+Earth Terminals (20 pcs)","Push in Fused Terminal Block (25 pcs)","End Plate For Fused Terminals (50 pcs)","Cross Connector For Fused Terminals (10 pcs)","Blade Fuse 2A (100 pcs)","Blade Fuse 5A (100 pcs)","Blade Fuse 10A (100 pcs)","Loxone CAT7 Cable (250m)","to translate","Dali Channel","Dali Channels","Circut (switched ) 16A"]
["FR","Canal dimmer (230V)","1-10V","Eclairage simple","Eclairage variation 230V","Eclairage 1-10V","Eclairage variation 24V DMX","Eclairage variation 24V Air","Sonde de temp 1-wire","Anémometre 24V","Contact d'ouverture intégré","Sortie numérique 5A","Sortie numérique 5-16A","Ouvrants (VR, stores ..)","not translated yet","BP 1 touche","BP 2 touches","BP 4 touches","BP 5 touches","Zone Music Server",null,"Porte étiquette (8 niveaux)","Plaque de fin pour bornier 8x4 (10pcs)","Bornier 3 + terre PMAK4 (50 pcs)"," Plaque de fin pour bornier 3 + terre PMAK4 (20 pcs)","Bornier 2 + Terre PDL  (50 pcs)","Délimitateur de rail Din (20 pcs)","Plaque de fin pour bornier 2 + terre PDL (20 pcs)","Bloc de terminal de fusible à connexion rapide (25 pcs)","Plaque de fin pour terminal de fusible (50 pcs)","Connecteur en croix pour terminal de fusible (10 pcs)","Fusible 2A (100 pcs)","Fusible 5A (100 pcs)","Fusible 10A (100 pcs)","Cat 7 250m","not translated yet","Dali Channel","Dali Channels","Eclairage simple 16A"]
["ES","Dimmer Extension [Canales]","Analógico 1-10V","Luminario ON/OFF 5A","Luminaria dimmer 230V","Luminaria dimmer 0-10V EVG","Canal dimmer DMX 50W","Canal dimmer Air 50W","Sensor de temperatura 1-Wire","Anemómetro 24V (necesaria entrada digital de Extension)","Contacto de ventana (integrado en ventana)","Consumidor 5A","Consumidor 5-16A","Sombreado (persiana, store,…)",null,"Pulsador digital 1 fase","Pulsador digital 2 fases","Pulsador digital 4 fases","Pulsador digital 5 fases","Music Server (seleccionar zonas)","Separador para bornes de Weidmüller (10Ud.)","Soporte de señalización para bornes (8 pisos) de Weidmüller (20Ud.)","Tapa final para borne 8x4 de Weidmüller (10Ud.)","Borne de 3 + tierra de Weidmüller","Tapa final para borne de 3 + tierra de Weidmüller (20Ud.)","Borne de 2 + tierra de Weidmüller (50Ud.)","Ángulo de fijación lateral de Weidmüller (20Ud.)","Tapa final para borne de 2 + tierra de Weidmüller (20Ud.)","Borne portafusibles de Weidmüller (25Ud.)","Tapa final para borne portafusibles de Weidmüller (50Ud.)","Conector transversal para borne portafusibles de Weidmüller (10Ud.)","Fusible 2A (100 unidades)","Fusible 5A (100 unidades)","Fusible 10A (100 unidades)","Cable CAT7 de Loxone","to translate","Canal Dali","Canales Dali","Luminario ON/OFF 16A"]
["CZ","Dimmer Extension (Výběr kanálu)","Analog 1-10V","Světelný okruh 5A","Stmívatelný okruh 230V","Stmívatelný okruh 0-10V s elektronickým předřadníkem","DMX Dimmer 50W na kanál","Air Dimmer kanál 50W","1-Wire teplotní senzor","Senzor rychlosti větru 24V (s digitálním vstupem na Extensionu)","Okenní kontakt (integrovaný v okně pouze DI)","Spotřebič do 5A","Spotřebič 5-16A","Stínění","to translate","1 Tlačítko","2 Tlačítko","4 Tlačítko","5 Tlačítko","Zóna Music Serveru","Předělovací deska PRV8 (10 ks)","Držák na značky pro PPV8/PRV8 (20ks)","Bočnice pro PPV8/PRV8 (10 ks)","Svorka na připojení motoru PMAK4 (50 ks)","Bočnice pro PMAK4 (20 ks)","Svorkovnice PDL (50ks)","Koncová podpěra svorkovnice ZEW (20 ks)","Bočnice pro PDL (20 ks)","Pojistková svorkovnice (25 ks)","Bočnice pojistkové svorkovnice (50 ks)","24 pólová propojka WEIDMÜLLER (10ks)","Pojistka 2A","Pojistka 5A (100ks)","Pojistka 10A (100ks)","Loxone CAT7 kabel (250m)","to translate","Dali Channel","Dali Channels","Světelný okruh 16A"]
["IT","Dimmer Extension [scelta canale]","Analogico 1-10V","Luce commutabile 5A","Luce dimmerabile 230V","Luce dimmerabile 0-10V","DMX canale dimmerabile 50W","Air canale dimmerabile 50W","Sensore temperatura 1-Wire","Sensore del vento 24V (rich. Extension con DI)","Contatto finestra (integrato nella finestra; DI)","Consumatore 5A","Consumatore 5-16A","Ombreggiatura (tapparelle, veneziane,...)","to translate","Pulsante digitale 1x","Pulsante digitale 2x","Pulsante digitale 4x","Pulsante digitale 5x","Music Server scelta canale","Piastra di separazione P-serie (10pz.)","Supporto per siglatura P-serie (20pz.)","Piastra terminale P-serie (10pz.)","Morsetto componibile colleg. motore PMAK4 (50pz.)","Piastra terminale PMAK4 (20pz.)","Morsetto per installazione ai piani PDL (50pz.)","Terminale di fissaggio ZEW 35 (20pz.)","Piastra terminale PDL (20pz.)","Morsetto componibile portafusibile (25pz.)","Piastra terminale portafusibile (50pz.)","Collegamento trasversale 24 poli (10pz.)","Fusibile 2A (100 pz.)","Fusibile 5A (100 pz.)","Fusibile 10A (100 pz.)","Loxone cavo CAT7 (250m)","to translate","Dali Channel","Dali Channels","Luce commutabile 16A"]
["CHE","not translated yet","not translated yet","not translated yet","not translated yet","not translated yet","not translated yet","not translated yet","not translated yet","not translated yet","not translated yet","not translated yet","not translated yet","not translated yet","not translated yet","not translated yet","not translated yet","not translated yet","not translated yet","not translated yet","not translated yet","not translated yet","not translated yet","not translated yet","not translated yet","not translated yet","not translated yet","not translated yet","not translated yet","not translated yet","not translated yet","not translated yet","not translated yet","not translated yet","not translated yet","not translated yet","Dali Channel","Dali Channels","not translated yet"]
["SK","Dimmer Extension (Výběr kanálu)","Analog 1-10V","Světelný okruh 5A","Stmívatelný okruh 230V","Stmívatelný okruh 0-10V s elektronickým předřadníkem","DMX Dimmer 50W na kanál","Air Dimmer kanál 50W","1-Wire teplotní senzor","Senzor rychlosti větru 24V (s digitálním vstupem na Extensionu)","Okenní kontakt (integrovaný v okně pouze DI)","Spotřebič do 5A","Spotřebič 5-16A","Stínění","to translate","1 Tlačítko","2 Tlačítko","4 Tlačítko","5 Tlačítko","Zóna Music Serveru","Předělovací deska PRV8 (10 ks)","Držák na značky pro PPV8/PRV8 (20ks)","Bočnice pro PPV8/PRV8 (10 ks)","Svorka na připojení motoru PMAK4 (50 ks)","Bočnice pro PMAK4 (20 ks)","Svorkovnice PDL (50ks)","Koncová podpěra svorkovnice ZEW (20 ks)","Bočnice pro PDL (20 ks)","Pojistková svorkovnice (25 ks)","Bočnice pojistkové svorkovnice (50 ks)","24 pólová propojka WEIDMÜLLER (10ks)","Pojistka 2A","Pojistka 5A (100ks)","Pojistka 10A (100ks)","Loxone CAT7 kabel (250m)","to translate","Dali Channel","Dali Channels","Světelný okruh 16A"]
["NL","Dimmer Extension [Kanaal keuze]","Analoog 1-10V","Lichtkring schakelbaar 5A","Lichtking dimmbaar 230V","Lichtkring dimmbaar 0-10V EVG","DMX Dimkanaal 50W","Air Dimkanaal 50W","1-Wire Temperatuurvoeler","Windsensor 24V (voor Extension met DI)","Raamcontact (in raam geïntegreerd; DI)","Verbruiker 5A","Verbruiker 5-16A","Beschaduwing (rolluik, lammellen,...)",null,"1-voudige digitale drukknop","2-voudige digitale drukknop","4-voudige digitale drukknop","5-voudige digitale drukknop","Muziek server zoneselectie","Scheidingswand P-serie (10 st.)","Markering houder P-serie (20 st.)","Afsluitplaat P-serie (10 st.)","Jaloezie afsluitplaat PMAK4 (50 st.)","Afsluitplaat PMAK4 (20 st.)","Installatie klem PDL (50 st.)","Eindklem ZEW 35 (20 st.)","Afsluitplaat PDL (20 st.)","Zekering klem (25 st.)","Afsluitplaat zekering klem (50 st.)","Kambrug voor klemmen 24 Polig (10 st.)","Zekering 2A (100 st.)","Zekering 5A (100 st.)","Zekering 10A (100 st.)","Loxone CAT7 Kabel (250m)",null,"Dali Channel","Dali Channels","Lichtkring schakelbaar 16A"]
["FI","not translated yet","not translated yet","not translated yet","not translated yet","not translated yet","not translated yet","not translated yet","not translated yet","not translated yet","not translated yet","not translated yet","not translated yet","not translated yet","not translated yet","not translated yet","not translated yet","not translated yet","not translated yet","not translated yet","not translated yet","not translated yet","not translated yet","not translated yet","not translated yet","not translated yet","not translated yet","not translated yet","not translated yet","not translated yet","not translated yet","not translated yet","not translated yet","not translated yet","not translated yet","not translated yet","Dali Channel","Dali Channels","not translated yet"]
["HU","not translated yet","not translated yet","not translated yet","not translated yet","not translated yet","not translated yet","not translated yet","not translated yet","not translated yet","not translated yet","not translated yet","not translated yet","not translated yet","not translated yet","not translated yet","not translated yet","not translated yet","not translated yet","not translated yet","not translated yet","not translated yet","not translated yet","not translated yet","not translated yet","not translated yet","not translated yet","not translated yet","not translated yet","not translated yet","not translated yet","not translated yet","not translated yet","not translated yet","not translated yet","not translated yet","Dali Channel","Dali Channels","not translated yet"]
["IE","not translated yet","not translated yet","not translated yet","not translated yet","not translated yet","not translated yet","not translated yet","not translated yet","not translated yet","not translated yet","not translated yet","not translated yet","not translated yet","not translated yet","not translated yet","not translated yet","not translated yet","not translated yet","not translated yet","not translated yet","not translated yet","not translated yet","not translated yet","not translated yet","not translated yet","not translated yet","not translated yet","not translated yet","not translated yet","not translated yet","not translated yet","not translated yet","not translated yet","not translated yet","not translated yet","Dali Channel","Dali Channels","not translated yet"]
["reservated","not translated yet","not translated yet","not translated yet","not translated yet","not translated yet","not translated yet","not translated yet","not translated yet","not translated yet","not translated yet","not translated yet","not translated yet","not translated yet","not translated yet","not translated yet","not translated yet","not translated yet","not translated yet","not translated yet","not translated yet","not translated yet","not translated yet","not translated yet","not translated yet","not translated yet","not translated yet","not translated yet","not translated yet","not translated yet","not translated yet","not translated yet","not translated yet","not translated yet","not translated yet","not translated yet","Dali Channel","Dali Channels","not translated yet"]
["reservated","not translated yet","not translated yet","not translated yet","not translated yet","not translated yet","not translated yet","not translated yet","not translated yet","not translated yet","not translated yet","not translated yet","not translated yet","not translated yet","not translated yet","not translated yet","not translated yet","not translated yet","not translated yet","not translated yet","not translated yet","not translated yet","not translated yet","not translated yet","not translated yet","not translated yet","not translated yet","not translated yet","not translated yet","not translated yet","not translated yet","not translated yet","not translated yet","not translated yet","not translated yet","not translated yet","Dali Channel","Dali Channels","not translated yet"]
["reservated","not translated yet","not translated yet","not translated yet","not translated yet","not translated yet","not translated yet","not translated yet","not translated yet","not translated yet","not translated yet","not translated yet","not translated yet","not translated yet","not translated yet","not translated yet","not translated yet","not translated yet","not translated yet","not translated yet","not translated yet","not translated yet","not translated yet","not translated yet","not translated yet","not translated yet","not translated yet","not translated yet","not translated yet","not translated yet","not translated yet","not translated yet","not translated yet","not translated yet","not translated yet","not translated yet","Dali Channel","Dali Channels","not translated yet"]
["reservated","not translated yet","not translated yet","not translated yet","not translated yet","not translated yet","not translated yet","not translated yet","not translated yet","not translated yet","not translated yet","not translated yet","not translated yet","not translated yet","not translated yet","not translated yet","not translated yet","not translated yet","not translated yet","not translated yet","not translated yet","not translated yet","not translated yet","not translated yet","not translated yet","not translated yet","not translated yet","not translated yet","not translated yet","not translated yet","not translated yet","not translated yet","not translated yet","not translated yet","not translated yet","not translated yet","Dali Channel","Dali Channels","not translated yet"]
["reservated","not translated yet","not translated yet","not translated yet","not translated yet","not translated yet","not translated yet","not translated yet","not translated yet","not translated yet","not translated yet","not translated yet","not translated yet","not translated yet","not translated yet","not translated yet","not translated yet","not translated yet","not translated yet","not translated yet","not translated yet","not translated yet","not translated yet","not translated yet","not translated yet","not translated yet","not translated yet","not translated yet","not translated yet","not translated yet","not translated yet","not translated yet","not translated yet","not translated yet","not translated yet","not translated yet","Dali Channel","Dali Channels","not translated yet"]
[]
[]
[]
[]
[]
["Message Box"]
["DE","Bitte entsprechende/n Verstärker manuell hinzufügen!","Bitte Dimmer (RGBW DMX/AIR) manuel hinzufügen je nach Lichtkreisen!"]
["EN_UK","Please add an amplifier manually!","Please add dimmer (dmx/air) manually due to your circuits!"]
["EN_US","Please add an amplifier manually!","Please add dimmer (dmx/air) manually due to your circuits!"]
["FR","Please add an amplifier manually!","Please add dimmer (dmx/air) manually due to your circuits!"]
["ES","Please add an amplifier manually!","Please add dimmer (dmx/air) manually due to your circuits!"]
["CZ","Please add an amplifier manually!","Please add dimmer (dmx/air) manually due to your circuits!"]
["IT","Si prega di aggiungere manualmente l'amplificatore!","Si prega di aggiungere manualmente il dimmer (RGBW DMX / AIR) secondo le luci commutabili!"]
["CHE","Please add an amplifier manually!","Please add dimmer (dmx/air) manually due to your circuits!"]
["SK","Please add an amplifier manually!","Please add dimmer (dmx/air) manually due to your circuits!"]
["NL","Please add an amplifier manually!","Please add dimmer (dmx/air) manually due to your circuits!"]
["FI","Please add an amplifier manually!","Please add dimmer (dmx/air) manually due to your circuits!"]
["HU","Please add an amplifier manually!","Please add dimmer (dmx/air) manually due to your circuits!"]
["IE","Please add an amplifier manually!","Please add dimmer (dmx/air) manually due to your circuits!"]
["reservated","Please add an amplifier manually!","Please add dimmer (dmx/air) manually due to your circuits!"]
["reservated","Please add an amplifier manually!","Please add dimmer (dmx/air) manually due to your circuits!"]
["reservated","Please add an amplifier manually!","Please add dimmer (dmx/air) manually due to your circuits!"]
["reservated","Please add an amplifier manually!","Please add dimmer (dmx/air) manually due to your circuits!"]
["reservated","Please add an amplifier manually!","Please add dimmer (dmx/air) manually due to your circuits!"]
[]
[]
[]
[]
["DE"]
["EN_UK"]
["EN_US"]
["FR"]
["ES"]
["CZ"]
["IT"]
["CHE"]
["SK"]
["NL"]
["FI"]
["HU"]
["IE"]
["reservated"]
["reservated"]
["reservated"]
["reservated"]
["reservated"]

{"sheet":"Message Box","index":23,"n_rows":3,"n_cols":3,"rows_kept":3,"cut":false,"hidden":true,"merged":[]}
[]
[null,"Verstärker:",{"$f":"VLOOKUP(Main!C2,Translating_general!A125:C142,2,FALSE)","v":"Please add an amplifier manually!"}]
[null,"Dimmer:",{"$f":"VLOOKUP(Main!C2,Translating_general!A125:C142,3,FALSE)","v":"Please add dimmer (dmx/air) manually due to your circuits!"}]

{"sheet":"Calculation","index":24,"n_rows":528,"n_cols":15,"rows_kept":528,"cut":false,"hidden":true,"merged":[[122,5,122,6],[123,5,123,6],[124,5,124,6],[125,5,125,6],[3,0,18,0],[74,3,74,4],[29,1,29,2],[47,1,47,2],[121,5,121,6]]}
["MsGO =",false,null,"AI (Eingang)","DI (Eingang)","AO (Ausgang)","DO (Ausgang)","1-Wire Kanal","Air Base Kanal","EnOcean","Tree","DO 16A","Air Dimmer","Dimmkanäle","Dali"]
[]
[null,null,null,"AI (Eingang)","DI (Eingang)","AO (Ausgang)","DO (Ausgang)","1-Wire Kanal","Air Base Kanal","EnOcean","Tree","DO 16A","Air Dimmer","Dali Kanäle","1-wire leser"]
["Eingabe Kunde","Benötigte Eingänge|Ausgänge|Kanäle",null,{"$f":"(E144+D200)*(-1)","v":0},{"$f":"(E200+D391)*(-1)","v":-9},{"$f":"F144*(-1)+G106*(-1)","v":0},{"$f":"(G144+D359+H77+E331)*(-1)","v":-22},{"$f":"(H144+H200)*(-1)","v":0},{"$f":"(E106+D265+E359+F391+I200+I144+L200)*(-1)","v":-8},{"$f":"(-1)*(E265+G391)","v":0},{"$f":"F286*(-1)","v":-32},{"$f":"D331*(-1)+K106*(-1)","v":-7},null,{"$f":"C513*-1","v":0},{"$f":"-1*D163","v":0}]
[null," +Miniserver (=WENN(…)+C278)",{"$f":"IF(B1=FALSE, IF(MIN(D4:O4)<0,1,0), 0)","v":1},{"$f":"$C$5*D62","v":4},{"$f":"$C$5*E62","v":8},{"$f":"$C$5*F62","v":4},{"$f":"$C$5*G62","v":8}]
[null," +MsGo",{"$f":"IF(AND(B1=TRUE, I4 < 0), 1+C229+C407, C229+C407)+IF(AND(B1=TRUE,I4 =0), 1,0)","v":0},null,null,null,null,null,{"$f":"C6*I71","v":0}]
[null," +Dimmer Extensions",{"$f":"C403+C79","v":0},null,{"$f":"C7*E67","v":0}]
[null,"Zwischensumme 1",null,{"$f":"SUM(D4:D7)","v":4},{"$f":"SUM(E4:E7)","v":-1},4,-14,0,-8,0,{"$f":"SUM(K4:K7)","v":-32},-7]
[null," +Relay Extension (=C286)",0,null,null,null,null,null,null,null,null,{"$f":"L68*C9","v":0}]
[null," +Multi Extension Air (=C288+C185)",0,null,{"$f":"$C$10*E70","v":0},null,null,{"$f":"$C$10*H70","v":0},null,null,null,{"$f":"$C$10*L70","v":0},{"$f":"C10","v":0}]
[null,"Zwischensumme 2",null,{"$f":"SUM(D8:D10)","v":4},{"$f":"SUM(E8:E10)","v":-1},4,-14,0,-8,0,{"$f":"SUM(K8:K10)","v":-32},-7]
[null," +1-Wire Extension (=C283+H132)",0,null,null,null,null,{"$f":"C12*H65","v":0}]
[null," +EnoCean Extension (=C213+C284)",0,null,null,null,null,null,null,{"$f":"C13*J66","v":0}]
[null," +Dali Extension",{"$f":"C410","v":0},null,null,null,null,null,null,null,null,null,null,{"$f":"C14*N74","v":0}]
[null," +Tree Extension",0,null,null,null,null,null,null,null,{"$f":"C15*K72","v":0}]
[null,"`+ DI Extension",{"$f":"C412","v":0},null,{"$f":"20*C16","v":0}]
[null," +AirBaseExtension (=C183+C287)",0,null,null,null,null,null,{"$f":"C17*I69","v":0}]
[null,"Zwischensumme 3",null,{"$f":"SUM(D11:D17)","v":4},{"$f":"SUM(E11:E17)","v":-1},{"$f":"SUM(F11:F17)","v":4},-14,{"$f":"SUM(H11:H17)","v":0},{"$f":"SUM(I11:I17)","v":-8},0,{"$f":"SUM(K11:K17)","v":-32},-7]
[null," +Extension (=C279)",0,{"$f":"$C$19*D63","v":0},{"$f":"$C$19*E63","v":0},{"$f":"$C$19*F63","v":0},{"$f":"$C$19*G63","v":0}]
[null,"Fehlende/Überschüssige Anschlüsse_AI_auf_DI",null,{"$f":"D18","v":4},{"$f":"E18","v":-1},{"$f":"SUM(F18:F19)","v":4},-14,0,-8,0,-32,{"$f":"L18","v":-7}]
[]
[null,"Anschlüsse vor autmomatische Ergänzung von fehlenden Extensions"]
[null,"Gesamt verfügbare Anschlüsse",null,{"$f":"D5+D6+D7+D9+D10+D12+D13+D17+D19","v":4},{"$f":"E5+E6+E7+E9+E10+E12+E13+E17+E19+E16","v":8},4,8,0,0,0,{"$f":"K15","v":0},0,{"$f":"M10","v":0},{"$f":"N14","v":0}]
[null,"Benötigte Anschlüsse",null,{"$f":"D4","v":0},-9,0,-22,0,-8,0,{"$f":"K4","v":-32},-7,null,{"$f":"N4","v":0}]
[null,"Übrigbleibende Anschlüsse",null,{"$f":"IF(D20>0,D20,0)","v":4},{"$f":"IF(E20>0,E20,0)","v":0},{"$f":"IF(F20>0,F20,0)","v":4},0,0,0,0,{"$f":"IF(K20>0,K20,0)","v":0},0,null,{"$f":"IF(N24>0,N24,0)","v":0}]
[null,{"$f":"Calculation!B221=Products!D35","v":true},null,{"$f":"IF(D20<0,D20,0)","v":0},{"$f":"IF(E20<0,E20,0)","v":-1},{"$f":"IF(F20<0,F20,0)","v":0},-14,0,-8,0,{"$f":"IF(K20<0,K20,0)","v":-32},-7]
[null,"Extensions für fehlende Anschlüsse"]
[null,"Extension",{"$f":"C29","v":0},{"$f":"$C$28*D63","v":0},{"$f":"$C$28*E63","v":0},{"$f":"$C$28*F63","v":0},{"$f":"$C$28*G63","v":0}]
[null,"Anzahlberechnung Extension",{"$f":"MAX(D29,F29)","v":0},{"$f":"IF(D20<0,ROUNDUP(D20/D63*(-1),0),0)","v":0},{"$f":"IF(E20<0,ROUNDUP(E20/E63*(-1),0),0)","v":1},{"$f":"IF(F20<0,ROUNDUP(F20/F63*(-1),0),0)","v":0},{"$f":"IF(G20<0,ROUNDUP(G20/G63*(-1),0),0)","v":2}]
[null,"Fehlende Anschlüsse ",null,{"$f":"D20+D28","v":4},{"$f":"E28+E20","v":-1},{"$f":"F20+F28","v":4},{"$f":"G20+G28","v":-14},{"$f":"H20","v":0},{"$f":"I20","v":-8},{"$f":"J20","v":0},{"$f":"K20","v":-32},{"$f":"L20","v":-7}]
[null,"AI auf DI Fehlende Anschlüsse","ben. AI",{"$f":"IF(AND(D30*-1<=E30,E30<0),D30-(D30+E30),IF(E30<0,D30,0))","v":1},{"$f":"IF(E30<0,E30+D30,E30)","v":3},"Entscheider ob weitere Extension"]
[null,"Fehlende Anschlüsse nach Umlegung",null,{"$f":"D30-D31","v":3},{"$f":"D31","v":1},"E29 =WENN(E28<0;E28+D28;E28)",null,null,{"$f":"IF(AND(E30<0,(E30+D30)>0),E30+D30-D31,0)","v":2}]
[null,null,null,null,{"$f":"E30+E32","v":0},null,null,null,{"$f":"IF(C35>0,C35*16+E33,0)","v":0}]
[]
[null,"Restliche Extension für DI",{"$f":"IF(E31<0,ROUNDUP(-E31/16,0),0)","v":0},{"$f":"IF(AND(C35>0,E35=0),(E31+C35*12)+C35*4,C35*4)","v":0},{"$f":"IF(AND(C35>0,ABS(E31)<C35*12),C35*12+E31,0)","v":0},{"$f":"$C$35*F63","v":0},{"$f":"$C$35*G63","v":0}]
[null,"Fehlende/Überschüssige Anschlüsse ",null,{"$f":"D32+D35","v":3},{"$f":"IF(AND(C35>0,ABS(E31)<C35*12),C35*12+E31,0)","v":0},{"$f":"F30+F35","v":4},{"$f":"G30+G35","v":-14},null,null,null,null,{"$f":"IF(G36<0,L20+G36,L20)","v":-21}]
[null,null,null,null,null,"E34 =WENN((E33+E29)<0;0;E33+E29) zuvor"]
[null,"Relay Extension",{"$f":"IF(L36<0,ROUNDUP(L36/L68*(-1),0),0)","v":2},null,null,null,null,null,null,null,null,{"$f":"C38*L68","v":28}]
[null,"Fehlende Anschlüsse ",null,{"$f":"D36","v":3},{"$f":"E36","v":0},{"$f":"F36","v":4},{"$f":"IF(G36>0,G36,0)","v":0},{"$f":"H30","v":0},{"$f":"I30","v":-8},{"$f":"J30","v":0},null,{"$f":"SUM(L36:L38)","v":7}]
[null,"1-Wire Extension",{"$f":"IF(H39<0,ROUNDUP(H39/H65*(-1),0),0)","v":0},null,null,null,null,{"$f":"C40*H65","v":0}]
[null,"Fehlende Anschlüsse ",null,{"$f":"SUM(D39:D40)","v":3},{"$f":"SUM(E39:E40)","v":0},4,0,0,-8,0,null,7]
[null,"EnOcean-Extension",{"$f":"IF(J41<0,ROUNDUP(J41/J66*(-1),0),0)","v":0},null,null,null,null,null,null,{"$f":"C42*J66","v":0}]
[null,"Fehlende Anschlüsse ",null,null,{"$f":"SUM(E41:E42)","v":0},{"$f":"SUM(F41:F42)","v":4},0,0,-8,0,{"$f":"K30","v":-32},7]
[null,"AirBaseExtension",{"$f":"IF(I43<0,ROUNDUP(I43/I69*(-1),0),0)","v":1},null,null,null,null,null,{"$f":"C44*I69","v":128}]
[null,"Tree Extension",{"$f":"IF(K43<0,ROUNDUP(K43/K72*(-1),0),0)","v":1},null,null,null,null,null,null,null,{"$f":"C45*K72","v":100}]
[null,"Dali Extension",{"$f":"IF((N24+N23)<0,ROUNDUP((N24+N23)/N74*(-1),0),0)","v":0},"Eine Extension unter \"MS + Ext.\" zählt nun ebenfalls zu den channels dazu und wird nichtmehr extra addiert"]
[null,"Zusätzlicher Miniserver (Basis Extensions)",{"$f":"IF(C58>1,C58-1,0)","v":0},{"$f":"$C$47*D5","v":0},{"$f":"$C$47*E5","v":0},{"$f":"$C$47*F5","v":0},{"$f":"$C$47*G5","v":0}]
[null,"Reserve nach Abdeckung fehlender Anschlüsse",null,{"$f":"D41+D47","v":3},{"$f":"SUM(E43:E47)","v":0},4,0,0,120,0,{"$f":"SUM(K43:K45)","v":68},{"$f":"SUM(L43:L47)","v":7}]
[]
[]
[]
[null,"Anschlüsse nach autmomatische Ergänzung von fehlenden Extensions"]
[null,"Gesamt verfügbare Anschlüsse",null,{"$f":"D23+D28+C35*4+C395*D62+D63*C396+D47","v":4},{"$f":"E23+E28+C35*12+C395*E62+C396*E63+E47+E70*(C228+C406)","v":8},{"$f":"F23+F28+F35+C395*F62+C396*F63+F47","v":4},{"$f":"G23+G28+G35+G47+C395*G62+C396*G63","v":8},{"$f":"H23+H40+C400*H65+(C228+C406)*H70","v":0},{"$f":"I23+I44+(C226+C405)*I69","v":128},{"$f":"J23+J44+(D226+D405)*J69","v":0},{"$f":"K23+K44+(E226+E405)*K69","v":0},{"$f":"L23+L38+C404*L68+(C228+C406)*L70","v":28},null,null,{"$f":"N23+C46*N74","v":0}]
[null,"Benötigte Anschlüsse",-1,{"$f":"ABS(D4)+D31+C35*4-D35","v":1},{"$f":"ABS(E4)-E32-(C35*4-D35)","v":8},{"$f":"F4*$C$54","v":0},{"$f":"G4*$C$54+IF(G36<0,G36,0)","v":8},{"$f":"H4*$C$54","v":0},{"$f":"I4*$C$54","v":8},{"$f":"J4*$C$54","v":0},{"$f":"K24+K45+(E227+E406)*K70","v":68},{"$f":"L4*$C$54-IF(G36<0,G36,0)","v":21},null,null,{"$f":"C513","v":0}]
[null,"Übrigbleibende Anschlüsse",null,{"$f":"D53-D54","v":3},{"$f":"E53-E54","v":0},{"$f":"F53-F54","v":4},0,0,120,0,{"$f":"K25+K47+(E228+E407)*K71","v":0},7,null,null,{"$f":"O53-O54","v":0}]
[]
[null,"Gesamtanzahl Extensions",{"$f":"Products!B8+Products!B11+Products!B12+Products!B13+Products!B14+Products!B15+Products!B21+Products!B23+Products!B24+Products!B26+Products!B28+Products!B40","v":3}]
[null,"Benötigte Miniserver inkl. Extensions",{"$f":"ROUNDUP(C57/30,0)","v":1}]
[]
[]
[null,null,null,"AI (Eingang)","DI (Eingang)","AO (Ausgang)","DO (Ausgang)","1-Wire Kanal","Air Base Kanal","EnOcean","Tree Kanal","DO 16A","DMX Kanäle","Dali Kanäle"]
[null,"Miniserver",null,{"$f":"Products!$J$7","v":4},{"$f":"Products!$K$7","v":8},{"$f":"Products!$L$7","v":4},{"$f":"Products!$M$7","v":8}]
[null,"Extension",null,{"$f":"Products!$J$8","v":4},{"$f":"Products!$K$8","v":12},{"$f":"Products!$L$8","v":4},{"$f":"Products!$M$8","v":8}]
[null,"DMX Extension",null,null,null,null,null,null,null,null,null,null,{"$f":"Products!$N$12","v":128}]
[null,"1-wire Extension",null,null,null,null,null,{"$f":"Products!$N$14","v":20}]
[null,"EnOcean Extension",null,null,null,null,null,null,null,{"$f":"Products!$N$15","v":128}]
[null,"Dimmer Extension",null,null,{"$f":"Products!$K$21","v":8},{"$f":"Products!$L$21","v":4}]
[null,"Relay Extension",null,null,null,null,null,null,null,null,null,{"$f":"Products!$M$23","v":14}]
[null,"Air Base Extension",null,null,null,null,null,null,{"$f":"Products!$N$24","v":128}]
[null,"Multi Extension Air",null,null,{"$f":"Products!$K$26","v":12},null,null,{"$f":"Products!$N$26","v":20},null,null,null,{"$f":"Products!$M$26","v":8},"Air Dimmer"]
[null,"Miniserver Go",null,null,null,null,null,null,{"$f":"Products!$N$30","v":128}]
[null,"Tree Extension",null,null,null,null,null,null,null,null,100]
[null,"DI Extension",null,null,20]
[null,"Dali Extension",null,null,null,null,null,null,null,null,null,null,null,64]
[null,null,null,"Benötigte Kanäle \nauf Extension \n(Basis LED Streifen)"]
[null,"Licht","Anzahl","DMX Ext.","Air Base Ext.","DMX Frei","AO","DO","Dimmer Kanäle frei",null,"DO 16A","Tree"]
[null,{"$f":"Light!B18","v":"Světelný okruh 5A"},{"$f":"IF(ISNA(VLOOKUP(B77,Main!$B$5:$C$15,2,FALSE)),0,VLOOKUP(B77,Main!$B$5:$C$15,2,FALSE))","v":3},null,null,null,null,{"$f":"1*C77","v":3}]
["100012",{"$f":"Light!B2","v":"DMX Extension"},{"$f":"IF(ISNA(VLOOKUP(B78,Main!$B$5:$C$15,2,FALSE)),0,VLOOKUP(B78,Main!$B$5:$C$15,2,FALSE))","v":0},null,null,{"$f":"Products!N12*C78","v":0}]
["100029",{"$f":"Light!B3","v":"Dimmer Extension (Výběr kanálu)"},{"$f":"ROUNDUP(IF(ISNA(VLOOKUP(B79,Main!$B$5:$C$15,2,FALSE)),0,VLOOKUP(B79,Main!$B$5:$C$15,2,FALSE))/4,0)","v":0},null,null,null,null,null,{"$f":"C79*4","v":0},null,null,null,null,{"$f":"ROUNDUP(IF(ISNA(VLOOKUP(B79,Main!$B$5:$C$15,2,FALSE)),0,VLOOKUP(B79,Main!$B$5:$C$15,2,FALSE)),0)","v":0}]
["100117",{"$f":"Light!B4","v":"RGBW 24V Dimmer DMX"},{"$f":"IF(ISNA(VLOOKUP(B80,Main!$B$5:$C$15,2,FALSE)),0,VLOOKUP(B80,Main!$B$5:$C$15,2,FALSE))","v":0},{"$f":"Products!N27*C80","v":0}]
["100125",{"$f":"Light!B5","v":"RGBW 24V Dimmer Air"},{"$f":"IF(ISNA(VLOOKUP(B81,Main!$B$5:$C$15,2,FALSE)),0,VLOOKUP(B81,Main!$B$5:$C$15,2,FALSE))","v":0},null,{"$f":"Products!N29*C81","v":0}]
["200042",{"$f":"Light!B6","v":"5m RGB LED pásky IP20 (bez ochrany proti vodě)"},{"$f":"IF(ISNA(VLOOKUP(B82,Main!$B$5:$C$15,2,FALSE)),0,VLOOKUP(B82,Main!$B$5:$C$15,2,FALSE))","v":0},null,null,null,null,null,"Slots Licht","DMX Ext."]
["200043",{"$f":"Light!B7","v":"5m LED pásky (teplá bílá) - IP20 (bez ochrany proti vodě)"},{"$f":"IF(ISNA(VLOOKUP(B83,Main!$B$5:$C$15,2,FALSE)),0,VLOOKUP(B83,Main!$B$5:$C$15,2,FALSE))","v":0},null,null,null,null,null,"Verfügbare Kanäle",{"$f":"F78","v":0}]
["200045","RGB Streifen - gelöscht",{"$f":"IF(ISNA(VLOOKUP(B84,Main!$B$5:$C$15,2,FALSE)),0,VLOOKUP(B84,Main!$B$5:$C$15,2,FALSE))","v":0},null,null,null,null,null,"Benötigte Kanäle",{"$f":"D80","v":0}]
["200046",{"$f":"Light!B8","v":"5m RGB LED pásky IP68 (proti potopení do vody)"},{"$f":"IF(ISNA(VLOOKUP(B85,Main!$B$5:$C$15,2,FALSE)),0,VLOOKUP(B85,Main!$B$5:$C$15,2,FALSE))","v":0},null,null,null,null,null,"Fehlende Kanäle",{"$f":"IF(J84>J83,J84-J83,0)","v":0}]
["200061",{"$f":"Light!B10","v":"5m LED pásky (teplá bílá) - IP65 (proti tryskající vodě)"},{"$f":"IF(ISNA(VLOOKUP(B86,Main!$B$5:$C$15,2,FALSE)),0,VLOOKUP(B86,Main!$B$5:$C$15,2,FALSE))","v":0},null,null,null,null,null,"Reserve",{"$f":"IF(J83>J84,J83-J84,0)","v":0}]
["200092",{"$f":"Light!B11","v":"5m LED pásky (teplá bílá) - IP68 (proti potopení do vody)"},{"$f":"IF(ISNA(VLOOKUP(B87,Main!$B$5:$C$15,2,FALSE)),0,VLOOKUP(B87,Main!$B$5:$C$15,2,FALSE))","v":0}]
["200098",{"$f":"Light!B12","v":"5m RGBW LED pásky IP20 (bez ochrany proti vodě)"},{"$f":"IF(ISNA(VLOOKUP(B88,Main!$B$5:$C$15,2,FALSE)),0,VLOOKUP(B88,Main!$B$5:$C$15,2,FALSE))","v":4},null,null,null,null,null,"DMX zusätzlich",{"$f":"ROUNDUP(J85/M64,0)","v":0}]
["200099",{"$f":"Light!B13","v":"5m RGBW LED pásky IP65 (proti tryskající vodě)"},{"$f":"IF(ISNA(VLOOKUP(B89,Main!$B$5:$C$15,2,FALSE)),0,VLOOKUP(B89,Main!$B$5:$C$15,2,FALSE))","v":0}]
["200100",{"$f":"Light!B14","v":"5m RGBW LED pásky IP68 (proti potopení do vody)"},{"$f":"IF(ISNA(VLOOKUP(B90,Main!$B$5:$C$15,2,FALSE)),0,VLOOKUP(B90,Main!$B$5:$C$15,2,FALSE))","v":0}]
[200280,{"$f":"Light!B15","v":"Příslušenství k LED páskům - set RGBW"},{"$f":"IF(ISNA(VLOOKUP(B91,Main!$B$5:$C$15,2,FALSE)),0,VLOOKUP(B91,Main!$B$5:$C$15,2,FALSE))","v":0}]
[200278,{"$f":"Light!B16","v":"Příslušenství k LED páskům - set WW"},{"$f":"IF(ISNA(VLOOKUP(B92,Main!$B$5:$C$15,2,FALSE)),0,VLOOKUP(B92,Main!$B$5:$C$15,2,FALSE))","v":0}]
[null,{"$f":"Light!B17","v":"Analog 1-10V"},{"$f":"IF(ISNA(VLOOKUP(B93,Main!$B$5:$C$15,2,FALSE)),0,VLOOKUP(B93,Main!$B$5:$C$15,2,FALSE))","v":0},null,null,null,{"$f":"1*C93","v":0}]
[100153,{"$f":"Light!B9","v":"Nano IO Air"},{"$f":"IF(ISNA(VLOOKUP(B94,Main!$B$5:$C$15,2,FALSE)),0,VLOOKUP(B94,Main!$B$5:$C$15,2,FALSE))","v":0},null,{"$f":"Products!N37*C94","v":0}]
["100204",{"$f":"Light!B19","v":"LED Spot RGBW"},{"$f":"IF(ISNA(VLOOKUP(B95,Main!$B$5:$C$15,2,FALSE)),0,VLOOKUP(B95,Main!$B$5:$C$15,2,FALSE))","v":9}]
["100203",{"$f":"Light!B20","v":"LED Spot WW"},{"$f":"IF(ISNA(VLOOKUP(B96,Main!$B$5:$C$15,2,FALSE)),0,VLOOKUP(B96,Main!$B$5:$C$15,2,FALSE))","v":24}]
[null,{"$f":"Light!B22","v":"Světelný okruh 16A"},{"$f":"IF(ISNA(VLOOKUP(B97,Main!$B$5:$C$15,2,FALSE)),0,VLOOKUP(B97,Main!$B$5:$C$15,2,FALSE))","v":0},null,null,null,null,null,null,null,{"$f":"C97*1","v":0}]
[null,{"$f":"Light!B23","v":"Příložný LED Spot RGBW bílá"},{"$f":"IF(ISNA(VLOOKUP(B98,Main!$B$5:$C$15,2,FALSE)),0,VLOOKUP(B98,Main!$B$5:$C$15,2,FALSE))","v":0}]
[null,{"$f":"Light!B24","v":"Příložný LED Spot WW bílá"},{"$f":"IF(ISNA(VLOOKUP(B99,Main!$B$5:$C$15,2,FALSE)),0,VLOOKUP(B99,Main!$B$5:$C$15,2,FALSE))","v":0}]
[null,{"$f":"Light!B25","v":"Příložný LED Spot Tree RGBW bílá"},{"$f":"IF(ISNA(VLOOKUP(B100,Main!$B$5:$C$15,2,FALSE)),0,VLOOKUP(B100,Main!$B$5:$C$15,2,FALSE))","v":0},null,null,null,null,null,null,null,null,{"$f":"C100","v":0}]
[null,{"$f":"Light!B26","v":"Příložný LED Spot Tree WW bílá"},{"$f":"IF(ISNA(VLOOKUP(B101,Main!$B$5:$C$15,2,FALSE)),0,VLOOKUP(B101,Main!$B$5:$C$15,2,FALSE))","v":0},null,null,null,null,null,null,null,null,{"$f":"C101","v":0}]
[null,{"$f":"Light!B27","v":"LED Spot Tree WW bílá"},{"$f":"IF(ISNA(VLOOKUP(B102,Main!$B$5:$C$15,2,FALSE)),0,VLOOKUP(B102,Main!$B$5:$C$15,2,FALSE))","v":0},null,null,null,null,null,null,null,null,{"$f":"C102","v":0}]
[null,{"$f":"Light!B28","v":"LED Spot Tree RGBW bílá"},{"$f":"IF(ISNA(VLOOKUP(B103,Main!$B$5:$C$15,2,FALSE)),0,VLOOKUP(B103,Main!$B$5:$C$15,2,FALSE))","v":0},null,null,null,null,null,null,null,null,{"$f":"C103","v":0}]
[null,{"$f":"Light!B29","v":"RGBW 24V Dimmer Tree"},{"$f":"IF(ISNA(VLOOKUP(B104,Main!$B$5:$C$15,2,FALSE)),0,VLOOKUP(B104,Main!$B$5:$C$15,2,FALSE))","v":9},null,null,null,null,null,null,null,null,{"$f":"C104","v":9}]
[null,{"$f":"Light!B30","v":"Krabice do betonu pro LED spot"},{"$f":"IF(ISNA(VLOOKUP(B105,Main!$B$5:$C$15,2,FALSE)),0,VLOOKUP(B105,Main!$B$5:$C$15,2,FALSE))","v":0}]
[null,null,"Summe",{"$f":"SUM(D77:D105)","v":0},{"$f":"SUM(E77:E104)","v":0},{"$f":"SUM(F77:F104)","v":0},{"$f":"SUM(G77:G104)","v":0},{"$f":"SUM(H77:H104)","v":3},null,null,{"$f":"SUM(K77:K97)","v":0},{"$f":"SUM(L77:L105)","v":9}]
[]
[null,"Information"]
[null,"Pro Streifen 1 Dimmer & Pro Dimmer 1 Netzteil"]
[null,"DMX Dimmer belegt immer 4 Kanäle auf DMX Extension"]
[null,"Dimmer Air belegt 1 Kanal auf Air Base Extension"]
[null,"Da Dimmer auch ausgewählt wird, verfügbare, benötigte, reserve und noch notwendige Kanäle berechnen"]
[null,"Berechnung Kanäle auf Basis Dimmer nicht Streifen"]
[null,"Netzteilrechner: Spalte mit Watt pro Streifen"]
[null,null,null,null,null,null,null,null,"Zusätzlich benötigt"]
[null,"2 Mal 1 Produkt auswählen geht nicht, weil Anzahl nicht zusammengezählt wird!",null,0,null,null,null,null,"Air Base Extension"]
[null,null,null,0,null,null,null,null,"Miniserver"]
[null,null,null,0]
[null,"Musik","Anzahl Stück",0]
["100165",{"$f":"Music!B3","v":"Loxone Music Server 4 Zóny"},{"$f":"IF(ISNA(VLOOKUP(B120,Main!$B$64:$C$72,2,FALSE)),0,VLOOKUP(B120,Main!$B$64:$C$72,2,FALSE))","v":0},0]
["100166",{"$f":"Music!B4","v":"Loxone Music Server 8 Zón"},{"$f":"IF(ISNA(VLOOKUP(B121,Main!$B$64:$C$72,2,FALSE)),0,VLOOKUP(B121,Main!$B$64:$C$72,2,FALSE))","v":0},0]
["100167",{"$f":"Music!B5","v":"Loxone Music Server 12 Zón"},{"$f":"IF(ISNA(VLOOKUP(B122,Main!$B$64:$C$72,2,FALSE)),0,VLOOKUP(B122,Main!$B$64:$C$72,2,FALSE))","v":0},0,null,"Loxone Music Server 4",null,{"$f":"IF(C131>(H126*20+H125*16+H124*12+H123*8),ROUNDUP((C131-H126*20-H125*16-H124*12-H123*8)/4,0),0)","v":1}]
["100168",{"$f":"Music!B6","v":"Loxone Music Server 16 Zón"},{"$f":"IF(ISNA(VLOOKUP(B123,Main!$B$64:$C$72,2,FALSE)),0,VLOOKUP(B123,Main!$B$64:$C$72,2,FALSE))","v":0},0,null,"Loxone Music Server 8",null,{"$f":"IF((C131-H126*20-H125*16-H124*12)<=4,0,IF((C131>(H126*20+H125*16+H124*12)),ROUNDUP((C131-H126*20-H125*16-H124*12)/8,0),0))","v":0}]
["100169",{"$f":"Music!B7","v":"Loxone Music Server 20 Zón"},{"$f":"IF(ISNA(VLOOKUP(B124,Main!$B$64:$C$72,2,FALSE)),0,VLOOKUP(B124,Main!$B$64:$C$72,2,FALSE))","v":0},0,null,"Loxone Music Server 12",null,{"$f":"IF((C131-H126*20-H125*16)<=8,0,IF((C131>(H126*20+H125*16)),ROUNDUP((C131-H126*20-H125*16)/12,0),0))","v":0}]
["200097",{"$f":"Music!B8","v":"Loxone Speaker"},{"$f":"IF(ISNA(VLOOKUP(B125,Main!$B$64:$C$72,2,FALSE)),0,VLOOKUP(B125,Main!$B$64:$C$72,2,FALSE))","v":5},"Message box sperren",null,"Loxone Music Server 16",null,{"$f":"IF((C131-H126*20)<=12,0,IF((C131>H126*20),ROUNDUP((C131-H126*20)/16,0),0))","v":0}]
["200110",{"$f":"Music!B9","v":"Loxone 12ti kanálový zesilovač"},{"$f":"IF(ISNA(VLOOKUP(B126,Main!$B$64:$C$72,2,FALSE)),0,VLOOKUP(B126,Main!$B$64:$C$72,2,FALSE))","v":1},0,null,"Loxone Music Server 20",null,{"$f":"IF(OR(C131=17,C131=18,C131=19,C131=37,C131=38,C131=39),1,0)+I126","v":0},{"$f":"ROUNDDOWN(C131/20,0)","v":0}]
["200150",{"$f":"Music!B10","v":"Instalační box pro Loxone reproduktor (speaker)"},{"$f":"IF(ISNA(VLOOKUP(B127,Main!$B$64:$C$72,2,FALSE)),0,VLOOKUP(B127,Main!$B$64:$C$72,2,FALSE))","v":0}]
["100205",{"$f":"Music!B13","v":"Loxone Music Server Upgrade"},{"$f":"IF(ISNA(VLOOKUP(B128,Main!$B$64:$C$72,2,FALSE)),0,VLOOKUP(B128,Main!$B$64:$C$72,2,FALSE))","v":0}]
["200202",{"$f":"Music!B12","v":"Loxone Speaker back box pro snížené stropy"},{"$f":"IF(ISNA(VLOOKUP(B129,Main!$B$64:$C$72,2,FALSE)),0,VLOOKUP(B129,Main!$B$64:$C$72,2,FALSE))","v":5}]
["200153",{"$f":"Music!B11","v":"Loxone Wall Speaker"},{"$f":"IF(ISNA(VLOOKUP(B130,Main!$B$64:$C$72,2,FALSE)),0,VLOOKUP(B130,Main!$B$64:$C$72,2,FALSE))","v":0}]
[null,{"$f":"Music!B2","v":"Zóna Music Serveru"},{"$f":"IF(ISNA(VLOOKUP(B131,Main!$B$64:$C$72,2,FALSE)),0,VLOOKUP(B131,Main!$B$64:$C$72,2,FALSE))","v":1}]
[]
[null,"Heizung","Anzahl Stück",null,"AI","AO","DO","1-Wire",null,null,"Tree"]
["100163",{"$f":"Heating!B2","v":0},{"$f":"IF(ISNA(VLOOKUP(B134,Main!$B$21:$C$25,2,FALSE)),0,VLOOKUP(B134,Main!$B$21:$C$25,2,FALSE))","v":0},null,null,null,null,null,{"$f":"C134","v":0}]
["200003",{"$f":"Heating!B3","v":0},{"$f":"IF(ISNA(VLOOKUP(B135,Main!$B$21:$C$25,2,FALSE)),0,VLOOKUP(B135,Main!$B$21:$C$25,2,FALSE))","v":0},null,{"$f":"Products!J57*C135","v":0}]
[200004,{"$f":"Heating!B4","v":"Hlavice Air"},{"$f":"IF(ISNA(VLOOKUP(B136,Main!$B$21:$C$25,2,FALSE)),0,VLOOKUP(B136,Main!$B$21:$C$25,2,FALSE))","v":0},null,null,null,null,null,{"$f":"1*C136","v":0}]
[200005,{"$f":"Heating!B5","v":"Venkovní senzor teploty"},{"$f":"IF(ISNA(VLOOKUP(B137,Main!$B$21:$C$25,2,FALSE)),0,VLOOKUP(B137,Main!$B$21:$C$25,2,FALSE))","v":0},null,null,null,{"$f":"Products!M59*C137","v":0}]
[200006,{"$f":"Heating!B6","v":"Vnitřní teplotní senzor 0-10V"},{"$f":"IF(ISNA(VLOOKUP(B138,Main!$B$21:$C$25,2,FALSE)),0,VLOOKUP(B138,Main!$B$21:$C$25,2,FALSE))","v":0},null,{"$f":"Products!J60*C138","v":0}]
[200010,{"$f":"Heating!B7","v":"Senzor teploty a vlhkosti (vnitřní) 0-10V"},{"$f":"IF(ISNA(VLOOKUP(B139,Main!$B$21:$C$25,2,FALSE)),0,VLOOKUP(B139,Main!$B$21:$C$25,2,FALSE))","v":0},null,{"$f":"Products!J62*C139","v":0}]
[200017,{"$f":"Heating!B8","v":"Senzor CO2/Teplota/Vlhkost"},{"$f":"IF(ISNA(VLOOKUP(B140,Main!$B$21:$C$25,2,FALSE)),0,VLOOKUP(B140,Main!$B$21:$C$25,2,FALSE))","v":0},null,{"$f":"Products!J65*C140","v":0}]
[200077,{"$f":"Heating!B9","v":"1-Wire teplotní čip v pouzdře"},{"$f":"IF(ISNA(VLOOKUP(B141,Main!$B$21:$C$25,2,FALSE)),0,VLOOKUP(B141,Main!$B$21:$C$25,2,FALSE))","v":0},null,null,null,null,{"$f":"Products!N87*C141","v":0}]
[200109,{"$f":"Heating!B10","v":"1-Wire teplotní senzor"},{"$f":"ROUNDUP(IF(ISNA(VLOOKUP(B142,Main!$B$21:$C$25,2,FALSE)),0,VLOOKUP(B142,Main!$B$21:$C$25,2,FALSE))/5,0)","v":0},null,null,null,null,{"$f":"Products!N103*C142","v":0}]
[null,{"$f":"Heating!B11","v":"Hlavice Tree"},{"$f":"IF(ISNA(VLOOKUP(B143,Main!$B$21:$C$25,2,FALSE)),0,VLOOKUP(B143,Main!$B$21:$C$25,2,FALSE))","v":6},null,null,null,null,null,null,null,{"$f":"C143*Products!N154","v":6}]
[null,null,null,"Summe",{"$f":"SUM(E134:E142)","v":0},{"$f":"SUM(F134:F142)","v":0},{"$f":"SUM(G134:G142)","v":0},{"$f":"SUM(H134:H142)","v":0},{"$f":"SUM(I134:I142)","v":0},null,{"$f":"SUM(K136:K143)","v":6},{"$f":"SUM(L136:L143)","v":0}]
[]
[null,null,null,null,null,null,null,null,"Zusätzlich benötigt"]
[null,null,null,null,null,null,null,null,"1-Wire Extension"]
[null,null,null,null,null,null,null,null,"Extension"]
[null,null,null,null,null,null,null,null,"Miniserver"]
[]
[]
[null,"Zutritt","Anzahl","1-Wire"]
["200063",{"$f":"Entry!B2","v":"Čtečka elektronického klíče"},{"$f":"IF(ISNA(VLOOKUP(B153,Main!$B$59:$C$62,2,FALSE)),0,VLOOKUP(B153,Main!$B$59:$C$62,2,FALSE))","v":0},{"$f":"Products!N83*C153","v":0},"Jeder Leser 1 Extension, außer es ist schon eine 1-Wire Extension vorhanden, dann hat dort 1 Leser platz"]
["200064",{"$f":"Entry!B3","v":"Elektronický klíč"},{"$f":"IF(ISNA(VLOOKUP(B154,Main!$B$59:$C$62,2,FALSE)),0,VLOOKUP(B154,Main!$B$59:$C$62,2,FALSE))","v":5},null,null,null,"Ben. Kanäle","Ben. Ext","Freie Plätze"]
["200070",{"$f":"Entry!B4","v":"Elektronický klíč (Magnetický)"},{"$f":"IF(ISNA(VLOOKUP(B155,Main!$B$59:$C$62,2,FALSE)),0,VLOOKUP(B155,Main!$B$59:$C$62,2,FALSE))","v":0},null,null,"Summe Leser",{"$f":"D163","v":0},{"$f":"G155","v":0},{"$f":"(G158+H155)*20","v":0}]
["200076",null,null,null,null,"S. Heizung",{"$f":"H4*(-1)-G155","v":0},{"$f":"IF(I155<G156,ROUNDUP((G156-I155)/20,0),0)","v":0}]
["200082"]
["200093",{"$f":"Entry!B5","v":"Loxone Intercom"},{"$f":"IF(ISNA(VLOOKUP(B158,Main!$B$59:$C$62,2,FALSE)),0,VLOOKUP(B158,Main!$B$59:$C$62,2,FALSE))","v":0},null,null,"vorh. Ext.",{"$f":"C400","v":0}]
["200094",{"$f":"Entry!B6","v":"Zapuštěný box pro Loxone Intercom"},{"$f":"IF(ISNA(VLOOKUP(B159,Main!$B$59:$C$62,2,FALSE)),0,VLOOKUP(B159,Main!$B$59:$C$62,2,FALSE))","v":1}]
["200095",{"$f":"Entry!B7","v":"Povrchový box pro Loxone Intercom"},{"$f":"IF(ISNA(VLOOKUP(B160,Main!$B$59:$C$62,2,FALSE)),0,VLOOKUP(B160,Main!$B$59:$C$62,2,FALSE))","v":0},null,null,null,{"$f":"IF(D163>(C40+C12),1,0)","v":0}]
["200191",{"$f":"Entry!B8","v":"čtečka elektronického klíče - nerez"},{"$f":"IF(ISNA(VLOOKUP(B161,Main!$B$59:$C$62,2,FALSE)),0,VLOOKUP(B161,Main!$B$59:$C$62,2,FALSE))","v":0},{"$f":"Products!N137*C161","v":0}]
["200273",{"$f":"Entry!B9","v":"Loxone Intercom XL"},{"$f":"IF(ISNA(VLOOKUP(B162,Main!$B$59:$C$62,2,FALSE)),0,VLOOKUP(B162,Main!$B$59:$C$62,2,FALSE))","v":1}]
[null,null,"Summe",{"$f":"SUM(D153:D162)","v":0}]
[]
[null,"Information",null,null,null,null,null,null,"Zusätzlich benötigt"]
[null,"1-Wire Extension (20 Slots) benötigt",null,null,null,null,null,null,"1-Wire Extension"]
[null,"1 Lesegerät = 1 Slot",null,null,null,null,null,null,"Miniserver"]
[]
[]
[null,"Sensoren","Anzahl","AI","DI",null,"1-Wire",null,null,null,"Tree","AIR"]
[200003,{"$f":"Sensors!B2","v":"Venkovní senzor teploty"},{"$f":"IF(ISNA(VLOOKUP(B171,Main!$B$27:$C$32,2,FALSE)),0,VLOOKUP(B171,Main!$B$27:$C$32,2,FALSE))","v":0},{"$f":"Products!J57*C171","v":0}]
[200006,{"$f":"Sensors!B3","v":"Vnitřní teplotní senzor 0-10V"},{"$f":"IF(ISNA(VLOOKUP(B172,Main!$B$27:$C$32,2,FALSE)),0,VLOOKUP(B172,Main!$B$27:$C$32,2,FALSE))","v":0},{"$f":"Products!J60*C172","v":0}]
[200010,{"$f":"Sensors!B4","v":"Senzor teploty a vlhkosti (vnitřní) 0-10V"},{"$f":"IF(ISNA(VLOOKUP(B173,Main!$B$27:$C$32,2,FALSE)),0,VLOOKUP(B173,Main!$B$27:$C$32,2,FALSE))","v":0},{"$f":"Products!J62*C173","v":0}]
[200017,{"$f":"Sensors!B5","v":"Senzor CO2/Teplota/Vlhkost"},{"$f":"IF(ISNA(VLOOKUP(B174,Main!$B$27:$C$32,2,FALSE)),0,VLOOKUP(B174,Main!$B$27:$C$32,2,FALSE))","v":0},{"$f":"Products!J65*C174","v":0}]
["200018",{"$f":"Sensors!B6","v":"Dešťový senzor (24V)"},{"$f":"IF(ISNA(VLOOKUP(B175,Main!$B$27:$C$32,2,FALSE)),0,VLOOKUP(B175,Main!$B$27:$C$32,2,FALSE))","v":0},null,{"$f":"Products!K66*C175","v":0}]
["200031",{"$f":"Sensors!B7","v":"Senzor teploty a vlhkosti (venkovní)"},{"$f":"IF(ISNA(VLOOKUP(B176,Main!$B$27:$C$32,2,FALSE)),0,VLOOKUP(B176,Main!$B$27:$C$32,2,FALSE))","v":0},{"$f":"Products!J67*C176","v":0}]
["200032",{"$f":"Sensors!B8","v":"Senzor osvětlení 0-10V"},{"$f":"IF(ISNA(VLOOKUP(B177,Main!$B$27:$C$32,2,FALSE)),0,VLOOKUP(B177,Main!$B$27:$C$32,2,FALSE))","v":0},{"$f":"Products!J68*C177","v":0}]
["200033",{"$f":"Sensors!B9","v":"Senzor rychlosti větru 24V (s digitálním vstupem na Extensionu)"},{"$f":"IF(ISNA(VLOOKUP(B178,Main!$B$27:$C$32,2,FALSE)),0,VLOOKUP(B178,Main!$B$27:$C$32,2,FALSE))","v":0},null,{"$f":"Products!K69*C178","v":0}]
["200034",{"$f":"Sensors!B10","v":"Držák pro senzor větru"},{"$f":"IF(ISNA(VLOOKUP(B179,Main!$B$27:$C$32,2,FALSE)),0,VLOOKUP(B179,Main!$B$27:$C$32,2,FALSE))","v":0},null,null,"Stück"]
["200054",{"$f":"Sensors!B11","v":"Ultrazvukový senzor 0-10V"},{"$f":"IF(ISNA(VLOOKUP(B180,Main!$B$27:$C$32,2,FALSE)),0,VLOOKUP(B180,Main!$B$27:$C$32,2,FALSE))","v":0},{"$f":"Products!J79*C180","v":0}]
[200077,{"$f":"Sensors!B12","v":"1-Wire teplotní čip v pouzdře"},{"$f":"IF(ISNA(VLOOKUP(B181,Main!$B$27:$C$32,2,FALSE)),0,VLOOKUP(B181,Main!$B$27:$C$32,2,FALSE))","v":0},null,null,null,null,{"$f":"Products!N87*C181","v":0}]
["200101",{"$f":"Sensors!B13","v":"Záplavový senzor"},{"$f":"IF(ISNA(VLOOKUP(B182,Main!$B$27:$C$32,2,FALSE)),0,VLOOKUP(B182,Main!$B$27:$C$32,2,FALSE))","v":0},null,{"$f":"Products!K101*C182","v":0}]
[200109,{"$f":"Sensors!B14","v":"1-Wire teplotní senzor set"},{"$f":"IF(ISNA(VLOOKUP(B183,Main!$B$27:$C$32,2,FALSE)),0,VLOOKUP(B183,Main!$B$27:$C$32,2,FALSE))","v":0},null,null,null,null,{"$f":"Products!N103*C183","v":0}]
["200112",{"$f":"Sensors!B15","v":"Senzor pohybu 24V (venkovní)"},{"$f":"IF(ISNA(VLOOKUP(B184,Main!$B$27:$C$32,2,FALSE)),0,VLOOKUP(B184,Main!$B$27:$C$32,2,FALSE))","v":2},null,{"$f":"Products!K105*C184","v":2}]
[null,{"$f":"Sensors!B16","v":"Okenní kontakt (integrovaný v okně pouze DI)"},{"$f":"IF(ISNA(VLOOKUP(B185,Main!$B$27:$C$32,2,FALSE)),0,VLOOKUP(B185,Main!$B$27:$C$32,2,FALSE))","v":7},null,{"$f":"C185","v":7}]
["200113",{"$f":"Sensors!B17","v":"Okenní kontakt"},{"$f":"IF(ISNA(VLOOKUP(B186,Main!$B$27:$C$32,2,FALSE)),0,VLOOKUP(B186,Main!$B$27:$C$32,2,FALSE))","v":0},null,{"$f":"Products!K106*C186","v":0}]
["200136",{"$f":"Sensors!B18","v":"Saunový senzor teplota/vlhkost"},{"$f":"IF(ISNA(VLOOKUP(B187,Main!$B$27:$C$32,2,FALSE)),0,VLOOKUP(B187,Main!$B$27:$C$32,2,FALSE))","v":0},{"$f":"Products!J109*C187","v":0}]
["200154",{"$f":"Sensors!B19","v":"Senzor tlaku 0-10V"},{"$f":"IF(ISNA(VLOOKUP(B188,Main!$B$27:$C$32,2,FALSE)),0,VLOOKUP(B188,Main!$B$27:$C$32,2,FALSE))","v":0},{"$f":"Products!J115*C188","v":0}]
["200155",{"$f":"Sensors!B20","v":"Senzor rozbití okna 24V"},{"$f":"IF(ISNA(VLOOKUP(B189,Main!$B$27:$C$32,2,FALSE)),0,VLOOKUP(B189,Main!$B$27:$C$32,2,FALSE))","v":0},null,{"$f":"Products!K116*C189","v":0}]
[null,{"$f":"Sensors!B21","v":"Pohybový senzor Tree anthrazit"},{"$f":"IF(ISNA(VLOOKUP(B190,Main!$B$27:$C$32,2,FALSE)),0,VLOOKUP(B190,Main!$B$27:$C$32,2,FALSE))","v":0},null,null,null,null,null,null,null,{"$f":"C190*Products!N152","v":0}]
[null,{"$f":"Sensors!B22","v":"Motion Sensor Tree bilá"},{"$f":"IF(ISNA(VLOOKUP(B191,Main!$B$27:$C$32,2,FALSE)),0,VLOOKUP(B191,Main!$B$27:$C$32,2,FALSE))","v":0},null,null,null,null,null,null,null,{"$f":"C191*Products!N153","v":0}]
[null,{"$f":"Sensors!B23","v":"Záplavový senzor Air"},{"$f":"IF(ISNA(VLOOKUP(B192,Main!$B$27:$C$32,2,FALSE)),0,VLOOKUP(B192,Main!$B$27:$C$32,2,FALSE))","v":0},null,null,null,null,null,{"$f":"C192*Products!N154","v":0},null,null,{"$f":"C192","v":0}]
[null,{"$f":"Sensors!B24","v":"Okenní a dveřní kontakt Air anthrazit"},{"$f":"IF(ISNA(VLOOKUP(B193,Main!$B$27:$C$32,2,FALSE)),0,VLOOKUP(B193,Main!$B$27:$C$32,2,FALSE))","v":0},null,null,null,null,null,{"$f":"C193*Products!N155","v":0},null,null,{"$f":"C193","v":0}]
[null,{"$f":"Sensors!B25","v":"Okenní a dveřní kontakt Air bílá"},{"$f":"IF(ISNA(VLOOKUP(B194,Main!$B$27:$C$32,2,FALSE)),0,VLOOKUP(B194,Main!$B$27:$C$32,2,FALSE))","v":0},null,null,null,null,null,{"$f":"C194*Products!N156","v":0},null,null,0]
[null,{"$f":"Sensors!B26","v":"Digital IN (Reserve)"},{"$f":"IF(ISNA(VLOOKUP(B195,Main!$B$27:$C$32,2,FALSE)),0,VLOOKUP(B195,Main!$B$27:$C$32,2,FALSE))","v":0},null,{"$f":"C195","v":0}]
[null,{"$f":"Sensors!B27","v":"Analog IN (Reserve)"},{"$f":"IF(ISNA(VLOOKUP(B196,Main!$B$27:$C$32,2,FALSE)),0,VLOOKUP(B196,Main!$B$27:$C$32,2,FALSE))","v":0},{"$f":"C196","v":0}]
[null,{"$f":"Products!D187","v":"Okenní klika Air"},{"$f":"IF(ISNA(VLOOKUP(B197,Main!$B$27:$C$32,2,FALSE)),0,VLOOKUP(B197,Main!$B$27:$C$32,2,FALSE))","v":0},null,null,null,null,null,null,null,null,{"$f":"C197","v":0}]
[null,{"$f":"Products!D189","v":"Meteostanice Tree"},{"$f":"IF(ISNA(VLOOKUP(B198,Main!$B$27:$C$32,2,FALSE)),0,VLOOKUP(B198,Main!$B$27:$C$32,2,FALSE))","v":0},null,null,null,null,null,null,null,{"$f":"C198","v":0}]
[null,{"$f":"Products!D190","v":"Meteostanice Air"},{"$f":"IF(ISNA(VLOOKUP(B199,Main!$B$27:$C$32,2,FALSE)),0,VLOOKUP(B199,Main!$B$27:$C$32,2,FALSE))","v":0},null,null,null,null,null,null,null,null,{"$f":"C199","v":0}]
[null,null,"Summe",{"$f":"SUM(D171:D199)","v":0},9,0,0,0,0,0,0,{"$f":"SUM(L171:L199)","v":0}]
[]
[]
[null,"Verteiler","Anzahl"]
["200168",{"$f":"Distributors!B2","v":"Svorka na DIN lištu PPV8 (20 kusů)"},{"$f":"IF(ISNA(VLOOKUP(B204,Main!$B$81:$C$90,2,FALSE)),0,VLOOKUP(B204,Main!$B$81:$C$90,2,FALSE))","v":0}]
["200169",{"$f":"Distributors!B3","v":"Propojovací rozvaděč PRV8 (20 kusů)"},{"$f":"IF(ISNA(VLOOKUP(B205,Main!$B$81:$C$90,2,FALSE)),0,VLOOKUP(B205,Main!$B$81:$C$90,2,FALSE))","v":0}]
["200170",{"$f":"Distributors!B4","v":"Předělovací deska PRV8 (10 ks)"},{"$f":"IF(ISNA(VLOOKUP(B206,Main!$B$81:$C$90,2,FALSE)),0,VLOOKUP(B206,Main!$B$81:$C$90,2,FALSE))","v":0}]
["200171",{"$f":"Distributors!B5","v":"Držák na značky pro PPV8/PRV8 (20ks)"},{"$f":"IF(ISNA(VLOOKUP(B207,Main!$B$81:$C$90,2,FALSE)),0,VLOOKUP(B207,Main!$B$81:$C$90,2,FALSE))","v":0}]
["200172",{"$f":"Distributors!B6","v":"Bočnice pro PPV8/PRV8 (10 ks)"},{"$f":"IF(ISNA(VLOOKUP(B208,Main!$B$81:$C$90,2,FALSE)),0,VLOOKUP(B208,Main!$B$81:$C$90,2,FALSE))","v":0}]
["200173",{"$f":"Distributors!B7","v":"Svorka na připojení motoru PMAK4 (50 ks)"},{"$f":"IF(ISNA(VLOOKUP(B209,Main!$B$81:$C$90,2,FALSE)),0,VLOOKUP(B209,Main!$B$81:$C$90,2,FALSE))","v":0}]
["200174",{"$f":"Distributors!B8","v":"Bočnice pro PMAK4 (20 ks)"},{"$f":"IF(ISNA(VLOOKUP(B210,Main!$B$81:$C$90,2,FALSE)),0,VLOOKUP(B210,Main!$B$81:$C$90,2,FALSE))","v":0}]
["200175",{"$f":"Distributors!B9","v":"Svorkovnice PDL (50ks)"},{"$f":"IF(ISNA(VLOOKUP(B211,Main!$B$81:$C$90,2,FALSE)),0,VLOOKUP(B211,Main!$B$81:$C$90,2,FALSE))","v":0}]
["200176",{"$f":"Distributors!B10","v":"Koncová podpěra svorkovnice ZEW (20 ks)"},{"$f":"IF(ISNA(VLOOKUP(B212,Main!$B$81:$C$90,2,FALSE)),0,VLOOKUP(B212,Main!$B$81:$C$90,2,FALSE))","v":0}]
["200177",{"$f":"Distributors!B11","v":"Bočnice pro PDL (20 ks)"},{"$f":"IF(ISNA(VLOOKUP(B213,Main!$B$81:$C$90,2,FALSE)),0,VLOOKUP(B213,Main!$B$81:$C$90,2,FALSE))","v":0}]
["200178",{"$f":"Distributors!B12","v":"Pojistková svorkovnice (25 ks)"},{"$f":"IF(ISNA(VLOOKUP(B214,Main!$B$81:$C$90,2,FALSE)),0,VLOOKUP(B214,Main!$B$81:$C$90,2,FALSE))","v":0}]
["200179",{"$f":"Distributors!B13","v":"Bočnice pojistkové svorkovnice (50 ks)"},{"$f":"IF(ISNA(VLOOKUP(B215,Main!$B$81:$C$90,2,FALSE)),0,VLOOKUP(B215,Main!$B$81:$C$90,2,FALSE))","v":0}]
["200180",{"$f":"Distributors!B14","v":"24 pólová propojka WEIDMÜLLER (10ks)"},{"$f":"IF(ISNA(VLOOKUP(B216,Main!$B$81:$C$90,2,FALSE)),0,VLOOKUP(B216,Main!$B$81:$C$90,2,FALSE))","v":0}]
["200181",{"$f":"Distributors!B15","v":"Pojistka 2A"},{"$f":"IF(ISNA(VLOOKUP(B217,Main!$B$81:$C$90,2,FALSE)),0,VLOOKUP(B217,Main!$B$81:$C$90,2,FALSE))","v":0}]
["200183",{"$f":"Distributors!B16","v":"Pojistka 5A (100ks)"},{"$f":"IF(ISNA(VLOOKUP(B218,Main!$B$81:$C$90,2,FALSE)),0,VLOOKUP(B218,Main!$B$81:$C$90,2,FALSE))","v":0}]
["200184",{"$f":"Distributors!B17","v":"Pojistka 10A (100ks)"},{"$f":"IF(ISNA(VLOOKUP(B219,Main!$B$81:$C$90,2,FALSE)),0,VLOOKUP(B219,Main!$B$81:$C$90,2,FALSE))","v":0}]
["200129",{"$f":"Distributors!B18","v":"Loxone CAT7 kabel (250m)"},{"$f":"IF(ISNA(VLOOKUP(B220,Main!$B$81:$C$90,2,FALSE)),0,VLOOKUP(B220,Main!$B$81:$C$90,2,FALSE))","v":0}]
["100150",{"$f":"Products!D35","v":"Loxone set nářadí"},{"$f":"IF(ISNA(VLOOKUP(B221,Main!$B$81:$C$90,2,FALSE)),0,VLOOKUP(B221,Main!$B$81:$C$90,2,FALSE))","v":0}]
[null,{"$f":"Products!D159","v":"20-ti pólová propojka Weidmuller (20 ks)"},{"$f":"IF(ISNA(VLOOKUP(B222,Main!$B$81:$C$90,2,FALSE)),0,VLOOKUP(B222,Main!$B$81:$C$90,2,FALSE))","v":0}]
[null,{"$f":"Products!D77","v":"Spojovací relé"},{"$f":"IF(ISNA(VLOOKUP(B223,Main!$B$81:$C$90,2,FALSE)),0,VLOOKUP(B223,Main!$B$81:$C$90,2,FALSE))","v":0}]
[]
[null,"Funk","Anzahl","Air Base","EnOcean","Kanäle frei","Info"]
["100114",{"$f":"Wireless!B2","v":"Air Base Extension"},{"$f":"IF(ISNA(VLOOKUP(B226,Main!$B$41:$C$50,2,FALSE)),0,VLOOKUP(B226,Main!$B$41:$C$50,2,FALSE))","v":0},null,null,{"$f":"Products!N24*C226","v":0}]
["100115",{"$f":"Wireless!B3","v":"Smart Socket Air Typ E"},{"$f":"IF(ISNA(VLOOKUP(B227,Main!$B$41:$C$50,2,FALSE)),0,VLOOKUP(B227,Main!$B$41:$C$50,2,FALSE))","v":2},{"$f":"Products!N25*C227","v":2}]
["100116",{"$f":"Wireless!B4","v":"Multi Extension Air"},{"$f":"IF(ISNA(VLOOKUP(B228,Main!$B$41:$C$50,2,FALSE)),0,VLOOKUP(B228,Main!$B$41:$C$50,2,FALSE))","v":0}]
["100139",{"$f":"Wireless!B5","v":"Miniserver Go"},{"$f":"IF(ISNA(VLOOKUP(B229,Main!$B$41:$C$50,2,FALSE)),0,VLOOKUP(B229,Main!$B$41:$C$50,2,FALSE))","v":0},null,null,{"$f":"Products!N30*C229","v":0}]
["100140",{"$f":"Wireless!B6","v":"Remote Air"},{"$f":"IF(ISNA(VLOOKUP(B230,Main!$B$41:$C$50,2,FALSE)),0,VLOOKUP(B230,Main!$B$41:$C$50,2,FALSE))","v":1},{"$f":"Products!N31*C230","v":1}]
["100141",{"$f":"Wireless!B7","v":"IR Control Air"},{"$f":"IF(ISNA(VLOOKUP(B231,Main!$B$41:$C$50,2,FALSE)),0,VLOOKUP(B231,Main!$B$41:$C$50,2,FALSE))","v":0},{"$f":"Products!N32*C231","v":0}]
["100142",{"$f":"Wireless!B8","v":"Detektor kouře Air"},{"$f":"IF(ISNA(VLOOKUP(B232,Main!$B$41:$C$50,2,FALSE)),0,VLOOKUP(B232,Main!$B$41:$C$50,2,FALSE))","v":3},{"$f":"Products!N33*C232","v":3}]
["100149",{"$f":"Wireless!B9","v":"Senzor teploty & vlhkosti Air"},{"$f":"IF(ISNA(VLOOKUP(B233,Main!$B$41:$C$50,2,FALSE)),0,VLOOKUP(B233,Main!$B$41:$C$50,2,FALSE))","v":0},{"$f":"Products!N34*C233","v":0}]
["100151",{"$f":"Wireless!B10","v":"IR Elektroměr Air"},{"$f":"IF(ISNA(VLOOKUP(B234,Main!$B$41:$C$50,2,FALSE)),0,VLOOKUP(B234,Main!$B$41:$C$50,2,FALSE))","v":0},{"$f":"Products!N36*C234","v":0}]
["100154",{"$f":"Wireless!B11","v":"Loxone Touch for Nano Bílá"},{"$f":"IF(ISNA(VLOOKUP(B235,Main!$B$41:$C$50,2,FALSE)),0,VLOOKUP(B235,Main!$B$41:$C$50,2,FALSE))","v":0}]
["100155",{"$f":"Wireless!B12","v":"Loxone Touch Air Bílá"},{"$f":"IF(ISNA(VLOOKUP(B236,Main!$B$41:$C$50,2,FALSE)),0,VLOOKUP(B236,Main!$B$41:$C$50,2,FALSE))","v":0},{"$f":"Products!N39*C236","v":0},null,null,null,null,"Zusätzlich Benötigt"]
["100163",{"$f":"Wireless!B18","v":"Hlavice Air"},{"$f":"IF(ISNA(VLOOKUP(B237,Main!$B$41:$C$50,2,FALSE)),0,VLOOKUP(B237,Main!$B$41:$C$50,2,FALSE))","v":0},{"$f":"Products!N34*C237","v":0}]
["200048",{"$f":"Wireless!B19","v":"SMA anténa 868 MHz"},{"$f":"IF(ISNA(VLOOKUP(B238,Main!$B$41:$C$50,2,FALSE)),0,VLOOKUP(B238,Main!$B$41:$C$50,2,FALSE))","v":0},null,null,null,"Stück",null,"Air Base Extension"]
["200059",{"$f":"Wireless!B37","v":"Enocean Bezdrátový okenní kontakt"},{"$f":"IF(ISNA(VLOOKUP(B239,Main!$B$41:$C$50,2,FALSE)),0,VLOOKUP(B239,Main!$B$41:$C$50,2,FALSE))","v":0},null,{"$f":"Products!N81*C239","v":0},null,null,null,"EnOcean Extension"]
["200067",{"$f":"Wireless!B38","v":"EnOcean bezdrátová hlavice"},{"$f":"IF(ISNA(VLOOKUP(B240,Main!$B$41:$C$50,2,FALSE)),0,VLOOKUP(B240,Main!$B$41:$C$50,2,FALSE))","v":0},null,{"$f":"Products!N85*C240","v":0},null,null,null,"Miniserver"]
["200135",{"$f":"Wireless!B39","v":"Enocean Bezdrátový pohybový senzor"},{"$f":"IF(ISNA(VLOOKUP(B241,Main!$B$41:$C$50,2,FALSE)),0,VLOOKUP(B241,Main!$B$41:$C$50,2,FALSE))","v":0},null,{"$f":"Products!N108*C241","v":0},null,null,null,"MiniserverGo"]
["200137",{"$f":"Wireless!B40","v":"EnOcean bezdrátový aktor"},{"$f":"IF(ISNA(VLOOKUP(B242,Main!$B$41:$C$50,2,FALSE)),0,VLOOKUP(B242,Main!$B$41:$C$50,2,FALSE))","v":0},null,{"$f":"Products!N110*C242","v":0}]
["200151",{"$f":"Wireless!B20","v":"SMA Anténa 4dBi 868 MHz"},{"$f":"IF(ISNA(VLOOKUP(B243,Main!$B$41:$C$50,2,FALSE)),0,VLOOKUP(B243,Main!$B$41:$C$50,2,FALSE))","v":0},null,null,null,"Stück"]
["100180",{"$f":"Products!D50","v":"Loxone Touch Air Anthrazit"},{"$f":"IF(ISNA(VLOOKUP(B244,Main!$B$41:$C$50,2,FALSE)),0,VLOOKUP(B244,Main!$B$41:$C$50,2,FALSE))","v":0},{"$f":"Products!N50*C244","v":0}]
["100181",{"$f":"Products!D51","v":"Loxone Touch for Nano Anthrazit"},{"$f":"IF(ISNA(VLOOKUP(B245,Main!$B$41:$C$50,2,FALSE)),0,VLOOKUP(B245,Main!$B$41:$C$50,2,FALSE))","v":0}]
["100182",{"$f":"Products!D52","v":"Trubkový Motor SOLIDline Air 10Nm"},{"$f":"IF(ISNA(VLOOKUP(B246,Main!$B$41:$C$50,2,FALSE)),0,VLOOKUP(B246,Main!$B$41:$C$50,2,FALSE))","v":0},{"$f":"Products!N52*C246","v":0}]
["100183",{"$f":"Products!D53","v":"Trubkový Motor SOLIDline Air 20Nm"},{"$f":"IF(ISNA(VLOOKUP(B247,Main!$B$41:$C$50,2,FALSE)),0,VLOOKUP(B247,Main!$B$41:$C$50,2,FALSE))","v":0},{"$f":"Products!N53*C247","v":0}]
["100184",{"$f":"Products!D54","v":"Trubkový Motor SOLIDline Air 50Nm"},{"$f":"IF(ISNA(VLOOKUP(B248,Main!$B$41:$C$50,2,FALSE)),0,VLOOKUP(B248,Main!$B$41:$C$50,2,FALSE))","v":0},{"$f":"Products!N54*C248","v":0}]
["100190",{"$f":"Products!D145","v":"Pohybový senzor Air"},{"$f":"IF(ISNA(VLOOKUP(B249,Main!$B$41:$C$50,2,FALSE)),0,VLOOKUP(B249,Main!$B$41:$C$50,2,FALSE))","v":1},{"$f":"Products!N145*C249","v":1}]
["100153",{"$f":"Products!D37","v":"Nano IO Air"},{"$f":"IF(ISNA(VLOOKUP(B250,Main!$B$41:$C$50,2,FALSE)),0,VLOOKUP(B250,Main!$B$41:$C$50,2,FALSE))","v":0},{"$f":"Products!N37*C250","v":0}]
["100211",{"$f":"Wireless!B23","v":"Záplavový senzor Air"},{"$f":"IF(ISNA(VLOOKUP(B251,Main!$B$41:$C$50,2,FALSE)),0,VLOOKUP(B251,Main!$B$41:$C$50,2,FALSE))","v":1},{"$f":"Products!N155*C251","v":1}]
["100213",{"$f":"Wireless!B24","v":"Okenní a dveřní kontakt Air anthrazit"},{"$f":"IF(ISNA(VLOOKUP(B252,Main!$B$41:$C$50,2,FALSE)),0,VLOOKUP(B252,Main!$B$41:$C$50,2,FALSE))","v":0},{"$f":"Products!N156*C252","v":0}]
["100210",{"$f":"Wireless!B25","v":"Okenní a dveřní kontakt Air bílá"},{"$f":"IF(ISNA(VLOOKUP(B253,Main!$B$41:$C$50,2,FALSE)),0,VLOOKUP(B253,Main!$B$41:$C$50,2,FALSE))","v":0},{"$f":"C253","v":0}]
[null,{"$f":"Wireless!B27","v":"Touch pure for Nano bílá"},{"$f":"IF(ISNA(VLOOKUP(B254,Main!$B$41:$C$50,2,FALSE)),0,VLOOKUP(B254,Main!$B$41:$C$50,2,FALSE))","v":0}]
[null,{"$f":"Wireless!B26","v":"Touch pure Air bílá"},{"$f":"IF(ISNA(VLOOKUP(B255,Main!$B$41:$C$50,2,FALSE)),0,VLOOKUP(B255,Main!$B$41:$C$50,2,FALSE))","v":0},{"$f":"C255","v":0}]
[null,{"$f":"Wireless!B28","v":"Nano Dimmer Air"},{"$f":"IF(ISNA(VLOOKUP(B256,Main!$B$41:$C$50,2,FALSE)),0,VLOOKUP(B256,Main!$B$41:$C$50,2,FALSE))","v":0},{"$f":"C256","v":0}]
[null,{"$f":"Products!D177","v":"Touch pure for Nano Anthracite"},{"$f":"IF(ISNA(VLOOKUP(B257,Main!$B$41:$C$50,2,FALSE)),0,VLOOKUP(B257,Main!$B$41:$C$50,2,FALSE))","v":0},{"$f":"0*C257","v":0}]
[null,{"$f":"Products!D179","v":"Touch pure Air Anthracite"},{"$f":"IF(ISNA(VLOOKUP(B258,Main!$B$41:$C$50,2,FALSE)),0,VLOOKUP(B258,Main!$B$41:$C$50,2,FALSE))","v":0},{"$f":"C258","v":0}]
[null,{"$f":"Products!D187","v":"Okenní klika Air"},{"$f":"IF(ISNA(VLOOKUP(B259,Main!$B$41:$C$50,2,FALSE)),0,VLOOKUP(B259,Main!$B$41:$C$50,2,FALSE))","v":0},{"$f":"C259","v":0}]
[null,{"$f":"Products!D190","v":"Meteostanice Air"},{"$f":"IF(ISNA(VLOOKUP(B260,Main!$B$41:$C$50,2,FALSE)),0,VLOOKUP(B260,Main!$B$41:$C$50,2,FALSE))","v":0},{"$f":"C260","v":0}]
[null,{"$f":"Products!D192","v":"Žaluziový pohon GJ56 Air 6Nm kabel nahoře"},{"$f":"IF(ISNA(VLOOKUP(B261,Main!$B$41:$C$50,2,FALSE)),0,VLOOKUP(B261,Main!$B$41:$C$50,2,FALSE))","v":0},{"$f":"C261","v":0}]
[null,{"$f":"Products!D193","v":"Žaluziový pohon GJ56 Air 20Nm kabel nahoře"},{"$f":"IF(ISNA(VLOOKUP(B262,Main!$B$41:$C$50,2,FALSE)),0,VLOOKUP(B262,Main!$B$41:$C$50,2,FALSE))","v":0},{"$f":"C262","v":0}]
[null,{"$f":"Products!D194","v":"Žaluziový pohon GJ56 Air 6Nm kabel dole"},{"$f":"IF(ISNA(VLOOKUP(B263,Main!$B$41:$C$50,2,FALSE)),0,VLOOKUP(B263,Main!$B$41:$C$50,2,FALSE))","v":0},0]
[null,{"$f":"Products!D195","v":"Žaluziový pohon GJ56 Air 20Nm kabel dole"},{"$f":"IF(ISNA(VLOOKUP(B264,Main!$B$41:$C$50,2,FALSE)),0,VLOOKUP(B264,Main!$B$41:$C$50,2,FALSE))","v":0},0]
[null,null,"Summe",{"$f":"SUM(D226:D264)","v":8},{"$f":"SUM(E226:E264)","v":0}]
[]
[]
[null,"Tree","Anzahl","Tree","Kanäle frei"]
[100218,{"$f":"Products!D150","v":"Tree Extension"},{"$f":"IF(ISNA(VLOOKUP(B269,Main!$B$34:$C$39,2,FALSE)),0,VLOOKUP(B269,Main!$B$34:$C$39,2,FALSE))","v":0}]
[100221,{"$f":"Products!D151","v":"Touch Tree bílá"},{"$f":"IF(ISNA(VLOOKUP(B270,Main!$B$34:$C$39,2,FALSE)),0,VLOOKUP(B270,Main!$B$34:$C$39,2,FALSE))","v":0},{"$f":"Products!N151*C270","v":0}]
[100222,{"$f":"Products!D152","v":"Touch Tree anthrazit"},{"$f":"IF(ISNA(VLOOKUP(B271,Main!$B$34:$C$39,2,FALSE)),0,VLOOKUP(B271,Main!$B$34:$C$39,2,FALSE))","v":0},{"$f":"Products!N152*C271","v":0}]
[100223,{"$f":"Products!D153","v":"Motion Sensor Tree bilá"},{"$f":"IF(ISNA(VLOOKUP(B272,Main!$B$34:$C$39,2,FALSE)),0,VLOOKUP(B272,Main!$B$34:$C$39,2,FALSE))","v":7},{"$f":"Products!N153*C272","v":7}]
[100225,{"$f":"Products!D154","v":"Hlavice Tree"},{"$f":"IF(ISNA(VLOOKUP(B273,Main!$B$34:$C$39,2,FALSE)),0,VLOOKUP(B273,Main!$B$34:$C$39,2,FALSE))","v":0},{"$f":"Products!N154*C273","v":0}]
[100224,{"$f":"Products!D158","v":"Pohybový senzor Tree anthrazit"},{"$f":"IF(ISNA(VLOOKUP(B274,Main!$B$34:$C$39,2,FALSE)),0,VLOOKUP(B274,Main!$B$34:$C$39,2,FALSE))","v":0},{"$f":"Products!N155*C274","v":0}]
[null,{"$f":"Products!D162","v":"Touch pure Air bílá"},{"$f":"IF(ISNA(VLOOKUP(B275,Main!$B$34:$C$39,2,FALSE)),0,VLOOKUP(B275,Main!$B$34:$C$39,2,FALSE))","v":0},{"$f":"1*C275","v":0}]
[null,{"$f":"Products!D164","v":"Touch pure Tree bílá"},{"$f":"IF(ISNA(VLOOKUP(B276,Main!$B$34:$C$39,2,FALSE)),0,VLOOKUP(B276,Main!$B$34:$C$39,2,FALSE))","v":0},{"$f":"1*C276","v":0}]
[null,{"$f":"Products!D175","v":"Nano DI Tree"},{"$f":"IF(ISNA(VLOOKUP(B277,Main!$B$34:$C$39,2,FALSE)),0,VLOOKUP(B277,Main!$B$34:$C$39,2,FALSE))","v":0},{"$f":"1*C277","v":0}]
[null,{"$f":"Products!D178","v":"Touch pure for Tree Anthracite"},{"$f":"IF(ISNA(VLOOKUP(B278,Main!$B$34:$C$39,2,FALSE)),0,VLOOKUP(B278,Main!$B$34:$C$39,2,FALSE))","v":0},{"$f":"1*C278","v":0}]
[null,{"$f":"Products!D182","v":"Příložný LED Spot Tree RGBW bílá"},{"$f":"IF(ISNA(VLOOKUP(B279,Main!$B$34:$C$39,2,FALSE)),0,VLOOKUP(B279,Main!$B$34:$C$39,2,FALSE))","v":0},0]
[null,{"$f":"Products!D183","v":"Příložný LED Spot Tree WW bílá"},{"$f":"IF(ISNA(VLOOKUP(B280,Main!$B$34:$C$39,2,FALSE)),0,VLOOKUP(B280,Main!$B$34:$C$39,2,FALSE))","v":0},0]
[null,{"$f":"Products!D184","v":"LED Spot Tree WW bílá"},{"$f":"IF(ISNA(VLOOKUP(B281,Main!$B$34:$C$39,2,FALSE)),0,VLOOKUP(B281,Main!$B$34:$C$39,2,FALSE))","v":0},0]
[null,{"$f":"Products!D185","v":"LED Spot Tree RGBW bílá"},{"$f":"IF(ISNA(VLOOKUP(B282,Main!$B$34:$C$39,2,FALSE)),0,VLOOKUP(B282,Main!$B$34:$C$39,2,FALSE))","v":0},0]
[null,{"$f":"Products!D186","v":"RGBW 24V Dimmer Tree"},{"$f":"IF(ISNA(VLOOKUP(B283,Main!$B$34:$C$39,2,FALSE)),0,VLOOKUP(B283,Main!$B$34:$C$39,2,FALSE))","v":0},0]
[null,{"$f":"Products!D189","v":"Meteostanice Tree"},{"$f":"IF(ISNA(VLOOKUP(B284,Main!$B$34:$C$39,2,FALSE)),0,VLOOKUP(B284,Main!$B$34:$C$39,2,FALSE))","v":0},0]
[null,null,"Summe",{"$f":"SUM(D270:D284)+F359","v":8}]
[null,null,"Summe mit anderen Kathegorien",null,null,{"$f":"D285+K391+K144+K200+L106","v":32},"sprich mit Kat. Switches"]
[]
[null,"Sonstiges",null,"DO 16A","DO","Modbus"]
[null,"Zubehör","Anzahl"]
["100008",{"$f":"Other!B12","v":"SD-Karta s firmwarem"},{"$f":"IF(ISNA(VLOOKUP(B290,Main!$B$92:$C$101,2,FALSE)),0,VLOOKUP(B290,Main!$B$92:$C$101,2,FALSE))","v":0}]
["100011",{"$f":"Other!B50","v":"RS485 Extension"},{"$f":"IF(ISNA(VLOOKUP(B291,Main!$B$92:$C$101,2,FALSE)),0,VLOOKUP(B291,Main!$B$92:$C$101,2,FALSE))","v":0}]
["100013",{"$f":"Other!B51","v":"RS 232 Extension"},{"$f":"IF(ISNA(VLOOKUP(B292,Main!$B$92:$C$101,2,FALSE)),0,VLOOKUP(B292,Main!$B$92:$C$101,2,FALSE))","v":0}]
["100015",{"$f":"Other!B52","v":"Enocean Extension"},{"$f":"IF(ISNA(VLOOKUP(B293,Main!$B$92:$C$101,2,FALSE)),0,VLOOKUP(B293,Main!$B$92:$C$101,2,FALSE))","v":0}]
["100023",{"$f":"Other!B13","v":"Neprodává se"},{"$f":"IF(ISNA(VLOOKUP(B294,Main!$B$92:$C$101,2,FALSE)),0,VLOOKUP(B294,Main!$B$92:$C$101,2,FALSE))","v":0}]
["100025",{"$f":"Other!B14","v":"Weather Service 1 rok"},{"$f":"IF(ISNA(VLOOKUP(B295,Main!$B$92:$C$101,2,FALSE)),0,VLOOKUP(B295,Main!$B$92:$C$101,2,FALSE))","v":0}]
["100026",{"$f":"Other!B15","v":"Weather Service 10 let"},{"$f":"IF(ISNA(VLOOKUP(B296,Main!$B$92:$C$101,2,FALSE)),0,VLOOKUP(B296,Main!$B$92:$C$101,2,FALSE))","v":0}]
["100027",{"$f":"Other!B16","v":"Caller Service 1 rok"},{"$f":"IF(ISNA(VLOOKUP(B297,Main!$B$92:$C$101,2,FALSE)),0,VLOOKUP(B297,Main!$B$92:$C$101,2,FALSE))","v":0}]
["100028",{"$f":"Other!B17","v":"Caller Service 10 let"},{"$f":"IF(ISNA(VLOOKUP(B298,Main!$B$92:$C$101,2,FALSE)),0,VLOOKUP(B298,Main!$B$92:$C$101,2,FALSE))","v":1}]
["100035",{"$f":"Other!B18","v":"IR Set"},{"$f":"IF(ISNA(VLOOKUP(B299,Main!$B$92:$C$101,2,FALSE)),0,VLOOKUP(B299,Main!$B$92:$C$101,2,FALSE))","v":0}]
["100124",{"$f":"Other!B53","v":"Modbus Extension"},{"$f":"IF(ISNA(VLOOKUP(B300,Main!$B$92:$C$101,2,FALSE)),0,VLOOKUP(B300,Main!$B$92:$C$101,2,FALSE))","v":0}]
["100178",{"$f":"Other!B19","v":"AquaStar Air 1.5\""},{"$f":"IF(ISNA(VLOOKUP(B301,Main!$B$92:$C$101,2,FALSE)),0,VLOOKUP(B301,Main!$B$92:$C$101,2,FALSE))","v":0}]
["100179",{"$f":"Other!B20","v":"AquaStar Air 2\""},{"$f":"IF(ISNA(VLOOKUP(B302,Main!$B$92:$C$101,2,FALSE)),0,VLOOKUP(B302,Main!$B$92:$C$101,2,FALSE))","v":0}]
["200001",{"$f":"Other!B21","v":"24V Zdroj (1.3A)"},{"$f":"IF(ISNA(VLOOKUP(B303,Main!$B$92:$C$101,2,FALSE)),0,VLOOKUP(B303,Main!$B$92:$C$101,2,FALSE))","v":0}]
["200002",{"$f":"Other!B22","v":"24V Zdroj (4.2A)"},{"$f":"IF(ISNA(VLOOKUP(B304,Main!$B$92:$C$101,2,FALSE)),0,VLOOKUP(B304,Main!$B$92:$C$101,2,FALSE))","v":0},null,null,null,null,null,"Modbus berechnung"]
["200007",{"$f":"Other!B23","v":"not available in this country"},{"$f":"IF(ISNA(VLOOKUP(B305,Main!$B$92:$C$101,2,FALSE)),0,VLOOKUP(B305,Main!$B$92:$C$101,2,FALSE))","v":0},null,null,null,null,null,"benötigt für Geräte",{"$f":"IF(Calculation!F331>0, 1, 0)","v":0}]
["200012",{"$f":"Other!B24","v":"Adaptér ventilu VA80"},{"$f":"IF(ISNA(VLOOKUP(B306,Main!$B$92:$C$101,2,FALSE)),0,VLOOKUP(B306,Main!$B$92:$C$101,2,FALSE))","v":0},null,null,null,null,null,"zusätzl. Ausgew.",{"$f":"Calculation!C300","v":0}]
["200013",{"$f":"Other!B25","v":"not available in this country"},{"$f":"IF(ISNA(VLOOKUP(B307,Main!$B$92:$C$101,2,FALSE)),0,VLOOKUP(B307,Main!$B$92:$C$101,2,FALSE))","v":0},null,null,null,null,null,null,{"$f":"SUM(J305:J306)","v":0}]
["200035",{"$f":"Other!B26","v":"24V Zdroj (10A)"},{"$f":"IF(ISNA(VLOOKUP(B308,Main!$B$92:$C$101,2,FALSE)),0,VLOOKUP(B308,Main!$B$92:$C$101,2,FALSE))","v":0}]
["200040",{"$f":"Other!B27","v":"Instalační krabice IP20 bílá"},{"$f":"IF(ISNA(VLOOKUP(B309,Main!$B$92:$C$101,2,FALSE)),0,VLOOKUP(B309,Main!$B$92:$C$101,2,FALSE))","v":0}]
["200049",{"$f":"Other!B28","v":"Spojovací relé"},{"$f":"IF(ISNA(VLOOKUP(B310,Main!$B$92:$C$101,2,FALSE)),0,VLOOKUP(B310,Main!$B$92:$C$101,2,FALSE))","v":0}]
["200107",{"$f":"Other!B29","v":"not available in this country"},{"$f":"IF(ISNA(VLOOKUP(B311,Main!$B$92:$C$101,2,FALSE)),0,VLOOKUP(B311,Main!$B$92:$C$101,2,FALSE))","v":0}]
["200143",{"$f":"Other!B30","v":"Zdroj 24V, 0,4A"},{"$f":"IF(ISNA(VLOOKUP(B312,Main!$B$92:$C$101,2,FALSE)),0,VLOOKUP(B312,Main!$B$92:$C$101,2,FALSE))","v":0}]
["200156",{"$f":"Other!B31","v":"1-fázový elektroměr (Modbus)"},{"$f":"IF(ISNA(VLOOKUP(B313,Main!$B$92:$C$101,2,FALSE)),0,VLOOKUP(B313,Main!$B$92:$C$101,2,FALSE))","v":0},null,null,{"$f":"C313","v":0}]
["200157",{"$f":"Other!B32","v":"3-fázový elektroměr (Modbus)"},{"$f":"IF(ISNA(VLOOKUP(B314,Main!$B$92:$C$101,2,FALSE)),0,VLOOKUP(B314,Main!$B$92:$C$101,2,FALSE))","v":0},null,null,{"$f":"C314","v":0}]
[null,{"$f":"Other!B33","v":"Spotřebič do 5A"},{"$f":"IF(ISNA(VLOOKUP(B315,Main!$B$92:$C$101,2,FALSE)),0,VLOOKUP(B315,Main!$B$92:$C$101,2,FALSE))","v":3},null,{"$f":"C315","v":3}]
[null,{"$f":"Other!B34","v":"Spotřebič 5-16A"},{"$f":"IF(ISNA(VLOOKUP(B316,Main!$B$92:$C$101,2,FALSE)),0,VLOOKUP(B316,Main!$B$92:$C$101,2,FALSE))","v":7},{"$f":"C316","v":7}]
["200161",{"$f":"Other!B36","v":"Napájecí zdroj do zásuvky 24V, 6,25A Typ E,F"},{"$f":"IF(ISNA(VLOOKUP(B317,Main!$B$92:$C$101,2,FALSE)),0,VLOOKUP(B317,Main!$B$92:$C$101,2,FALSE))","v":0}]
["200207",{"$f":"Other!B35","v":"Keba KeContact P20 Wallbox"},{"$f":"IF(ISNA(VLOOKUP(B318,Main!$B$92:$C$101,2,FALSE)),0,VLOOKUP(B318,Main!$B$92:$C$101,2,FALSE))","v":0}]
["200281",{"$f":"Other!B37","v":"NFC Smart tagy"},{"$f":"IF(ISNA(VLOOKUP(B319,Main!$B$92:$C$101,2,FALSE)),0,VLOOKUP(B319,Main!$B$92:$C$101,2,FALSE))","v":0}]
["200294",{"$f":"Other!B38","v":"Nabíjecí kabel typ 2"},{"$f":"IF(ISNA(VLOOKUP(B320,Main!$B$92:$C$101,2,FALSE)),0,VLOOKUP(B320,Main!$B$92:$C$101,2,FALSE))","v":0}]
[null,{"$f":"Other!B39","v":"Spínaný LED zdroj 24V 2,5A"},{"$f":"IF(ISNA(VLOOKUP(B321,Main!$B$92:$C$101,2,FALSE)),0,VLOOKUP(B321,Main!$B$92:$C$101,2,FALSE))","v":0}]
[null,{"$f":"Other!B40","v":"Dvoužilový kroucený kabel modrá/bílá"},{"$f":"IF(ISNA(VLOOKUP(B322,Main!$B$92:$C$101,2,FALSE)),0,VLOOKUP(B322,Main!$B$92:$C$101,2,FALSE))","v":0}]
[null,{"$f":"Other!B41","v":"Dvoužilový kroucený kabel oranžová/bílá"},{"$f":"IF(ISNA(VLOOKUP(B323,Main!$B$92:$C$101,2,FALSE)),0,VLOOKUP(B323,Main!$B$92:$C$101,2,FALSE))","v":0}]
[null,{"$f":"Other!B42","v":"Dvoužilový kroucený kabel zelená/bílá"},{"$f":"IF(ISNA(VLOOKUP(B324,Main!$B$92:$C$101,2,FALSE)),0,VLOOKUP(B324,Main!$B$92:$C$101,2,FALSE))","v":0}]
[null,{"$f":"Other!B43","v":"Duracell Plus Power AA (12 ks)"},{"$f":"IF(ISNA(VLOOKUP(B325,Main!$B$92:$C$101,2,FALSE)),0,VLOOKUP(B325,Main!$B$92:$C$101,2,FALSE))","v":0}]
[null,{"$f":"Other!B44","v":"Duracell Plus Power AAA (12 ks)"},{"$f":"IF(ISNA(VLOOKUP(B326,Main!$B$92:$C$101,2,FALSE)),0,VLOOKUP(B326,Main!$B$92:$C$101,2,FALSE))","v":0}]
[null,{"$f":"Other!B45","v":"CR2032 Lithium Battery (20 ks)"},{"$f":"IF(ISNA(VLOOKUP(B327,Main!$B$92:$C$101,2,FALSE)),0,VLOOKUP(B327,Main!$B$92:$C$101,2,FALSE))","v":0}]
[null,{"$f":"Other!B46","v":"CR2450 Lithium Battery (20 ks)"},{"$f":"IF(ISNA(VLOOKUP(B328,Main!$B$92:$C$101,2,FALSE)),0,VLOOKUP(B328,Main!$B$92:$C$101,2,FALSE))","v":0}]
[null,{"$f":"Other!B47","v":"FDK 9V Lithium Battery"},{"$f":"IF(ISNA(VLOOKUP(B329,Main!$B$92:$C$101,2,FALSE)),0,VLOOKUP(B329,Main!$B$92:$C$101,2,FALSE))","v":0}]
[null,{"$f":"Other!B48","v":"not available in this country"},{"$f":"IF(ISNA(VLOOKUP(B330,Main!$B$92:$C$101,2,FALSE)),0,VLOOKUP(B330,Main!$B$92:$C$101,2,FALSE))","v":0}]
[null,null,"Summe",{"$f":"D316","v":7},{"$f":"E315","v":3},{"$f":"SUM(F290:F320)","v":0}]
[]
[]
[null,"Fans&Partner","Anzahl"]
["100004",{"$f":"Other!B2","v":"Rollup český"},{"$f":"IF(ISNA(VLOOKUP(B335,Main!$B$103:$C$107,2,FALSE)),0,VLOOKUP(B335,Main!$B$103:$C$107,2,FALSE))","v":0}]
["100170",{"$f":"Other!B3","v":"not available in this country"},{"$f":"IF(ISNA(VLOOKUP(B336,Main!$B$103:$C$107,2,FALSE)),0,VLOOKUP(B336,Main!$B$103:$C$107,2,FALSE))","v":0}]
["200050",{"$f":"Other!B4","v":"Loxone samolepky"},{"$f":"IF(ISNA(VLOOKUP(B337,Main!$B$103:$C$107,2,FALSE)),0,VLOOKUP(B337,Main!$B$103:$C$107,2,FALSE))","v":0}]
["200086",{"$f":"Other!B5","v":"Loxone Fanshirt S"},{"$f":"IF(ISNA(VLOOKUP(B338,Main!$B$103:$C$107,2,FALSE)),0,VLOOKUP(B338,Main!$B$103:$C$107,2,FALSE))","v":0}]
["200087",{"$f":"Other!B6","v":"Loxone Fanshirt M"},{"$f":"IF(ISNA(VLOOKUP(B339,Main!$B$103:$C$107,2,FALSE)),0,VLOOKUP(B339,Main!$B$103:$C$107,2,FALSE))","v":0}]
["200088",{"$f":"Other!B7","v":"Loxone Fanshirt L"},{"$f":"IF(ISNA(VLOOKUP(B340,Main!$B$103:$C$107,2,FALSE)),0,VLOOKUP(B340,Main!$B$103:$C$107,2,FALSE))","v":0}]
["200089",{"$f":"Other!B8","v":"Loxone Fanshirt XL"},{"$f":"IF(ISNA(VLOOKUP(B341,Main!$B$103:$C$107,2,FALSE)),0,VLOOKUP(B341,Main!$B$103:$C$107,2,FALSE))","v":0}]
["200090",{"$f":"Other!B9","v":"Loxone Fanshirt XXL"},{"$f":"IF(ISNA(VLOOKUP(B342,Main!$B$103:$C$107,2,FALSE)),0,VLOOKUP(B342,Main!$B$103:$C$107,2,FALSE))","v":0}]
["200158",{"$f":"Other!B10","v":"not available in this country"},{"$f":"IF(ISNA(VLOOKUP(B343,Main!$B$103:$C$107,2,FALSE)),0,VLOOKUP(B343,Main!$B$103:$C$107,2,FALSE))","v":0}]
["200186",{"$f":"Other!B11","v":"Loxone brožurka - 25 kusů"},{"$f":"IF(ISNA(VLOOKUP(B344,Main!$B$103:$C$107,2,FALSE)),0,VLOOKUP(B344,Main!$B$103:$C$107,2,FALSE))","v":0}]
[]
[]
[null,"Beschattung","Anzahl","DO","Air Base","Tree"]
[100153,{"$f":"Shading!B2","v":"Nano IO Air"},{"$f":"IF(ISNA(VLOOKUP(B348,Main!$B$17:$C$19,2,FALSE)),0,VLOOKUP(B348,Main!$B$17:$C$19,2,FALSE))","v":0},null,{"$f":"Products!N37*C348","v":0}]
[null,{"$f":"Shading!B3","v":"Stínění"},{"$f":"IF(ISNA(VLOOKUP(B349,Main!$B$17:$C$19,2,FALSE)),0,VLOOKUP(B349,Main!$B$17:$C$19,2,FALSE))","v":8},{"$f":"2*C349","v":16}]
["100182",{"$f":"Products!D52","v":"Trubkový Motor SOLIDline Air 10Nm"},{"$f":"IF(ISNA(VLOOKUP(B350,Main!$B$17:$C$19,2,FALSE)),0,VLOOKUP(B350,Main!$B$17:$C$19,2,FALSE))","v":0},0,{"$f":"C350","v":0}]
["100183",{"$f":"Products!D53","v":"Trubkový Motor SOLIDline Air 20Nm"},{"$f":"IF(ISNA(VLOOKUP(B351,Main!$B$17:$C$19,2,FALSE)),0,VLOOKUP(B351,Main!$B$17:$C$19,2,FALSE))","v":0},{"$f":"Products!N53*C351","v":0},{"$f":"C351","v":0}]
["100184",{"$f":"Products!D54","v":"Trubkový Motor SOLIDline Air 50Nm"},{"$f":"IF(ISNA(VLOOKUP(B352,Main!$B$17:$C$19,2,FALSE)),0,VLOOKUP(B352,Main!$B$17:$C$19,2,FALSE))","v":0},{"$f":"Products!N54*C352","v":0},0]
[null,{"$f":"Products!D189","v":"Meteostanice Tree"},{"$f":"IF(ISNA(VLOOKUP(B353,Main!$B$17:$C$19,2,FALSE)),0,VLOOKUP(B353,Main!$B$17:$C$19,2,FALSE))","v":1},null,null,{"$f":"1*C353","v":1}]
[null,{"$f":"Products!D190","v":"Meteostanice Air"},{"$f":"IF(ISNA(VLOOKUP(B354,Main!$B$17:$C$19,2,FALSE)),0,VLOOKUP(B354,Main!$B$17:$C$19,2,FALSE))","v":0},null,{"$f":"1*C354","v":0}]
[null,{"$f":"Products!D192","v":"Žaluziový pohon GJ56 Air 6Nm kabel nahoře"},{"$f":"IF(ISNA(VLOOKUP(B355,Main!$B$17:$C$19,2,FALSE)),0,VLOOKUP(B355,Main!$B$17:$C$19,2,FALSE))","v":0},null,{"$f":"C355","v":0}]
[null,{"$f":"Products!D193","v":"Žaluziový pohon GJ56 Air 20Nm kabel nahoře"},{"$f":"IF(ISNA(VLOOKUP(B356,Main!$B$17:$C$19,2,FALSE)),0,VLOOKUP(B356,Main!$B$17:$C$19,2,FALSE))","v":0},null,{"$f":"C356","v":0}]
[null,{"$f":"Products!D194","v":"Žaluziový pohon GJ56 Air 6Nm kabel dole"},{"$f":"IF(ISNA(VLOOKUP(B357,Main!$B$17:$C$19,2,FALSE)),0,VLOOKUP(B357,Main!$B$17:$C$19,2,FALSE))","v":0},null,0]
[null,{"$f":"Products!D195","v":"Žaluziový pohon GJ56 Air 20Nm kabel dole"},{"$f":"IF(ISNA(VLOOKUP(B358,Main!$B$17:$C$19,2,FALSE)),0,VLOOKUP(B358,Main!$B$17:$C$19,2,FALSE))","v":0},null,0]
[null,null,"Summe",{"$f":"SUM(D348:D355)","v":16},{"$f":"SUM(E348:E358)","v":0},{"$f":"SUM(F348:F355)","v":1},null,null,"Zusätzlich Benötigt"]
[null,null,null,null,null,null,null,null,"Air Base Extension"]
[null,null,null,null,null,null,null,null,"Extension"]
[null,"Information",null,null,null,null,null,null,"Miniserver"]
[null,"Rollo per Kabel zu NANO IO und Nano zu AirBase per Funk"]
[null,"pro Rollo/Markise/Jalousie/Raffstore 1 Nano"]
[null,"1 Nano belegt 1 Kanal auf AirBase"]
[null,"Nano Air (DI6,DO2, 1W-Ausgang Sensor)"]
[null,"DI für Taster z.B."]
[null,"DO für Jalousie etc."]
[]
[]
[null,"Taster","Anzahl","DI","AI","Airbase","EnOcean",null,null,null,"TREE"]
[null,{"$f":"Switch!B2","v":"1 Tlačítko"},{"$f":"IF(ISNA(VLOOKUP(B372,Main!$B$52:$C$57,2,FALSE)),0,VLOOKUP(B372,Main!$B$52:$C$57,2,FALSE))","v":0},{"$f":"1*C372","v":0}]
[null,{"$f":"Switch!B3","v":"2 Tlačítko"},{"$f":"IF(ISNA(VLOOKUP(B373,Main!$B$52:$C$57,2,FALSE)),0,VLOOKUP(B373,Main!$B$52:$C$57,2,FALSE))","v":0},{"$f":"2*C373","v":0},null,null,null,null,null,null,null,null,"Information"]
[null,{"$f":"Switch!B4","v":"4 Tlačítko"},{"$f":"IF(ISNA(VLOOKUP(B374,Main!$B$52:$C$57,2,FALSE)),0,VLOOKUP(B374,Main!$B$52:$C$57,2,FALSE))","v":0},{"$f":"4*C374","v":0}]
[null,{"$f":"Switch!B5","v":"5 Tlačítko"},{"$f":"IF(ISNA(VLOOKUP(B375,Main!$B$52:$C$57,2,FALSE)),0,VLOOKUP(B375,Main!$B$52:$C$57,2,FALSE))","v":0},{"$f":"5*C375","v":0},null,null,null,null,null,null,null,null,"AI auch bei DI möglich, wenn frei!"]
["100154",{"$f":"Switch!B6","v":"Loxone Touch for Nano Bílá"},{"$f":"IF(ISNA(VLOOKUP(B376,Main!$B$52:$C$57,2,FALSE)),0,VLOOKUP(B376,Main!$B$52:$C$57,2,FALSE))","v":0},null,null,{"$f":"Products!N38*C376","v":0}]
["100155",{"$f":"Switch!B7","v":"Loxone Touch Air Bílá"},{"$f":"IF(ISNA(VLOOKUP(B377,Main!$B$52:$C$57,2,FALSE)),0,VLOOKUP(B377,Main!$B$52:$C$57,2,FALSE))","v":0},null,null,{"$f":"Products!N39*C377","v":0}]
[200057,{"$f":"Switch!B8","v":"Enocean Bezdrátové tlačítko"},{"$f":"IF(ISNA(VLOOKUP(B378,Main!$B$52:$C$57,2,FALSE)),0,VLOOKUP(B378,Main!$B$52:$C$57,2,FALSE))","v":0},null,null,null,{"$f":"Products!N80*C378","v":0}]
["100180",{"$f":"Switch!B9","v":"Loxone Touch Air Anthrazit"},{"$f":"IF(ISNA(VLOOKUP(B379,Main!$B$52:$C$57,2,FALSE)),0,VLOOKUP(B379,Main!$B$52:$C$57,2,FALSE))","v":0},null,null,{"$f":"Products!N50*C244","v":0}]
["100181",{"$f":"Switch!B10","v":"Loxone Touch for Nano Anthrazit"},{"$f":"IF(ISNA(VLOOKUP(B380,Main!$B$52:$C$57,2,FALSE)),0,VLOOKUP(B380,Main!$B$52:$C$57,2,FALSE))","v":0},null,null,{"$f":"Products!N51*C245","v":0}]
[null,{"$f":"Switch!B11","v":"Touch Tree bílá"},{"$f":"IF(ISNA(VLOOKUP(B381,Main!$B$52:$C$57,2,FALSE)),0,VLOOKUP(B381,Main!$B$52:$C$57,2,FALSE))","v":5},null,null,null,null,null,null,null,{"$f":"C381*Products!N151","v":5}]
[null,{"$f":"Switch!B14","v":"Touch pure for Nano bílá"},{"$f":"IF(ISNA(VLOOKUP(B382,Main!$B$52:$C$57,2,FALSE)),0,VLOOKUP(B382,Main!$B$52:$C$57,2,FALSE))","v":0}]
[null,{"$f":"Switch!B15","v":"Touch pure Tree bílá"},{"$f":"IF(ISNA(VLOOKUP(B383,Main!$B$52:$C$57,2,FALSE)),0,VLOOKUP(B383,Main!$B$52:$C$57,2,FALSE))","v":4},null,null,null,null,null,null,null,{"$f":"1*C383","v":4}]
[null,{"$f":"Switch!B12","v":"Touch Tree anthrazit"},{"$f":"IF(ISNA(VLOOKUP(B384,Main!$B$52:$C$57,2,FALSE)),0,VLOOKUP(B384,Main!$B$52:$C$57,2,FALSE))","v":0},null,null,null,null,null,null,null,{"$f":"C384*Products!N152","v":0}]
[null,{"$f":"Wireless!B26","v":"Touch pure Air bílá"},{"$f":"IF(ISNA(VLOOKUP(B385,Main!$B$52:$C$57,2,FALSE)),0,VLOOKUP(B385,Main!$B$52:$C$57,2,FALSE))","v":0},null,null,{"$f":"C385","v":0}]
[null,{"$f":"Switch!B16","v":"Touch pure for Nano Anthracite"},{"$f":"IF(ISNA(VLOOKUP(B386,Main!$B$52:$C$57,2,FALSE)),0,VLOOKUP(B386,Main!$B$52:$C$57,2,FALSE))","v":0}]
[null,{"$f":"Switch!B17","v":"Touch pure for Tree Anthracite"},{"$f":"IF(ISNA(VLOOKUP(B387,Main!$B$52:$C$57,2,FALSE)),0,VLOOKUP(B387,Main!$B$52:$C$57,2,FALSE))","v":0},null,null,null,null,null,null,null,{"$f":"C387","v":0}]
[null,{"$f":"Switch!B18","v":"Touch pure Air Anthracite"},{"$f":"IF(ISNA(VLOOKUP(B388,Main!$B$52:$C$57,2,FALSE)),0,VLOOKUP(B388,Main!$B$52:$C$57,2,FALSE))","v":0},null,null,{"$f":"C388","v":0}]
[null,null,{"$f":"IF(ISNA(VLOOKUP(B389,Main!$B$52:$C$57,2,FALSE)),0,VLOOKUP(B389,Main!$B$52:$C$57,2,FALSE))","v":0}]
[null,null,{"$f":"IF(ISNA(VLOOKUP(B390,Main!$B$52:$C$57,2,FALSE)),0,VLOOKUP(B390,Main!$B$52:$C$57,2,FALSE))","v":0}]
[null,null,"Summe",{"$f":"SUM(D372:D390)","v":0},{"$f":"SUM(E372:E390)","v":0},{"$f":"SUM(F372:F390)","v":0},{"$f":"SUM(G372:G378)","v":0},null,null,null,{"$f":"SUM(K372:K390)","v":9}]
[]
[]
[null,"Ms & Extensions","Anzahl","AI (Eingang)","DI (Eingang)","AO (Ausgang)","DO (Ausgang)","1-Wire Kanal","Air Base Kanal","EnOcean","Tree","DO 16A","DMX Kanäle","DMX Air Dimmer","Dali"]
["100001",{"$f":"'Ms&Extensions'!B2","v":"Miniserver"},{"$f":"IF(ISNA(VLOOKUP(B395,Main!$B$76:$C$79,2,FALSE)),0,VLOOKUP(B395,Main!$B$76:$C$79,2,FALSE))","v":0},{"$f":"Products!$J$7*C395","v":0},{"$f":"Products!$K$7*C395","v":0},{"$f":"Products!$L$7*C395","v":0},{"$f":"Products!$M$7*C395","v":0}]
["100002",{"$f":"'Ms&Extensions'!B3","v":"Extension"},{"$f":"IF(ISNA(VLOOKUP(B396,Main!$B$76:$C$79,2,FALSE)),0,VLOOKUP(B396,Main!$B$76:$C$79,2,FALSE))","v":0},{"$f":"Products!$J$8*C396","v":0},{"$f":"Products!$K$8*C396","v":0},{"$f":"Products!$L$8*C396","v":0},{"$f":"Products!$M$8*C396","v":0}]
["100011",{"$f":"'Ms&Extensions'!B4","v":"RS485 Extension"},{"$f":"IF(ISNA(VLOOKUP(B397,Main!$B$76:$C$79,2,FALSE)),0,VLOOKUP(B397,Main!$B$76:$C$79,2,FALSE))","v":0}]
["100012",{"$f":"'Ms&Extensions'!B5","v":"DMX Extension"},{"$f":"IF(ISNA(VLOOKUP(B398,Main!$B$76:$C$79,2,FALSE)),0,VLOOKUP(B398,Main!$B$76:$C$79,2,FALSE))","v":0},null,null,null,null,null,null,null,null,null,{"$f":"Products!$N$12*C398","v":0}]
["100013",{"$f":"'Ms&Extensions'!B6","v":"RS 232 Extension"},{"$f":"IF(ISNA(VLOOKUP(B399,Main!$B$76:$C$79,2,FALSE)),0,VLOOKUP(B399,Main!$B$76:$C$79,2,FALSE))","v":0}]
["100014",{"$f":"'Ms&Extensions'!B7","v":"1-Wire Extension"},{"$f":"IF(ISNA(VLOOKUP(B400,Main!$B$76:$C$79,2,FALSE)),0,VLOOKUP(B400,Main!$B$76:$C$79,2,FALSE))","v":0},null,null,null,null,{"$f":"Products!$N$14*C400","v":0}]
["100015",{"$f":"'Ms&Extensions'!B8","v":"Enocean Extension"},{"$f":"IF(ISNA(VLOOKUP(B401,Main!$B$76:$C$79,2,FALSE)),0,VLOOKUP(B401,Main!$B$76:$C$79,2,FALSE))","v":0},null,null,null,null,null,null,{"$f":"Products!$N$15*C401","v":0}]
[100124,{"$f":"Products!D28","v":"Modbus Extension"},{"$f":"IF(ISNA(VLOOKUP(B402,Main!$B$76:$C$79,2,FALSE)),0,VLOOKUP(B402,Main!$B$76:$C$79,2,FALSE))","v":0}]
["100029",{"$f":"'Ms&Extensions'!B10","v":"Dimmer Extension"},{"$f":"IF(ISNA(VLOOKUP(B403,Main!$B$76:$C$79,2,FALSE)),0,VLOOKUP(B403,Main!$B$76:$C$79,2,FALSE))","v":0},null,{"$f":"Products!$K$21*C403","v":0},{"$f":"Products!$L$21*C403","v":0}]
["100038",{"$f":"'Ms&Extensions'!B11","v":"Relay Extension"},{"$f":"IF(ISNA(VLOOKUP(B404,Main!$B$76:$C$79,2,FALSE)),0,VLOOKUP(B404,Main!$B$76:$C$79,2,FALSE))","v":0},null,null,null,null,null,null,null,null,{"$f":"Products!$M$23*C404","v":0}]
["100114",{"$f":"'Ms&Extensions'!B12","v":"Air Base Extension"},{"$f":"IF(ISNA(VLOOKUP(B405,Main!$B$76:$C$79,2,FALSE)),0,VLOOKUP(B405,Main!$B$76:$C$79,2,FALSE))","v":0},null,null,null,null,null,{"$f":"Products!$N$24*C405","v":0}]
["100116",{"$f":"'Ms&Extensions'!B13","v":"Multi Extension Air"},{"$f":"IF(ISNA(VLOOKUP(B406,Main!$B$76:$C$79,2,FALSE)),0,VLOOKUP(B406,Main!$B$76:$C$79,2,FALSE))","v":0},null,{"$f":"Products!$K$26*C406","v":0},null,null,{"$f":"Products!$N$26*C406","v":0},null,null,null,{"$f":"Products!$M$26*C406","v":0},null,{"$f":"C406","v":0}]
["100139",{"$f":"'Ms&Extensions'!B14","v":"Miniserver Go"},{"$f":"IF(ISNA(VLOOKUP(B407,Main!$B$76:$C$79,2,FALSE)),0,VLOOKUP(B407,Main!$B$76:$C$79,2,FALSE))","v":0},null,null,null,null,null,{"$f":"Products!$N$30*C407","v":0}]
["100158",{"$f":"'Ms&Extensions'!B15","v":"Fröling Extension"},{"$f":"IF(ISNA(VLOOKUP(B408,Main!$B$76:$C$79,2,FALSE)),0,VLOOKUP(B408,Main!$B$76:$C$79,2,FALSE))","v":0}]
[null,{"$f":"Products!D150","v":"Tree Extension"},{"$f":"IF(ISNA(VLOOKUP(B409,Main!$B$76:$C$79,2,FALSE)),0,VLOOKUP(B409,Main!$B$76:$C$79,2,FALSE))","v":0},null,null,null,null,null,null,null,1]
[null,{"$f":"'Ms&Extensions'!B17","v":"Dali Extension"},{"$f":"IF(ISNA(VLOOKUP(B410,Main!$B$76:$C$79,2,FALSE)),0,VLOOKUP(B410,Main!$B$76:$C$79,2,FALSE))","v":0}]
[null,{"$f":"'Ms&Extensions'!B18","v":"Internorm Extension"},{"$f":"IF(ISNA(VLOOKUP(B411,Main!$B$76:$C$79,2,FALSE)),0,VLOOKUP(B411,Main!$B$76:$C$79,2,FALSE))","v":0}]
[null,{"$f":"'Ms&Extensions'!B19","v":"DI Extension"},{"$f":"IF(ISNA(VLOOKUP(B412,Main!$B$76:$C$79,2,FALSE)),0,VLOOKUP(B412,Main!$B$76:$C$79,2,FALSE))","v":0},null,20]
[null,"Netzteilrechner","Anzahl","Ampere/Stk","Gesamt"]
["100001",{"$f":"'Ms&Extensions'!B2","v":"Miniserver"},{"$f":"Products!B7","v":1},{"$f":"0.12","v":0.12},{"$f":"C414*D414","v":0.12}]
["100002",{"$f":"'Ms&Extensions'!B3","v":"Extension"},{"$f":"Products!B8","v":0},{"$f":"0.06","v":0.06},{"$f":"C415*D415","v":0},null,null,null,null,"Summe Netzteile"]
["100011",{"$f":"'Ms&Extensions'!B4","v":"RS485 Extension"},{"$f":"Products!B11","v":0},0.03,0,null,"1,3A Netzteil",{"$f":"IF((E430-H417*4.2)<4.2,ROUNDUP((E430-H417*4.2)/1.3,0),0)","v":1},null,"0,4A Netzteil",null,{"$f":"H432","v":0}]
["100012",{"$f":"'Ms&Extensions'!B5","v":"DMX Extension"},{"$f":"Products!B12","v":0},0.03,0,null,"4,2A Netzteil",{"$f":"ROUNDDOWN(E430/4.2,0)","v":0},null,"1,3A Netzteil",null,{"$f":"H416+H455","v":2}]
["100013",{"$f":"'Ms&Extensions'!B6","v":"RS 232 Extension"},{"$f":"Products!B13","v":0},{"$f":"0.03","v":0.03},0,null,null,null,null,"4,2A Netzteil",null,{"$f":"H417+H435+H456","v":1}]
["100014",{"$f":"'Ms&Extensions'!B7","v":"1-Wire Extension"},{"$f":"Products!B14","v":0},{"$f":"0.03","v":0.03},0,null,null,null,null,"10A Netzteil",null,{"$f":"H436+H457","v":2}]
["100015",{"$f":"'Ms&Extensions'!B8","v":"Enocean Extension"},{"$f":"Products!B15","v":0},{"$f":"0.03","v":0.03},0]
["100029",{"$f":"'Ms&Extensions'!B10","v":"Dimmer Extension"},{"$f":"Products!B21","v":0},0.06,0]
["100035",{"$f":"Products!D22","v":"IR Set"},{"$f":"Products!B22","v":0},0.03,0,null,null,null,"Extensions"]
["100038",{"$f":"'Ms&Extensions'!B11","v":"Relay Extension"},{"$f":"Products!B23","v":2},{"$f":"0.3","v":0.3},0.6,null,null,null,"Verfügbar",{"$f":"H416*1.3+H417*4.2","v":1.3}]
["100114",{"$f":"'Ms&Extensions'!B12","v":"Air Base Extension"},{"$f":"Products!B24","v":1},6.0000000000000001E-3,6.0000000000000001E-3,null,null,null,"Benötigt",{"$f":"E430","v":0.73080000000000001}]
["100124",{"$f":"Products!D28","v":"Modbus Extension"},{"$f":"Products!B28","v":0},0.03,{"$f":"C425*D425","v":0}]
["100158",{"$f":"'Ms&Extensions'!B15","v":"Fröling Extension"},{"$f":"Products!B40","v":0},0.03,{"$f":"C426*D426","v":0}]
[null,{"$f":"Products!D150","v":"Tree Extension"},{"$f":"Products!B150","v":1},{"$f":"Products!O150","v":4.7999999999999996E-3},{"$f":"C427*D427","v":4.7999999999999996E-3}]
[null,{"$f":"Products!D160","v":"Dali Extension"},{"$f":"Products!B160","v":0},0.1,{"$f":"C428*D428","v":0}]
[]
[null,null,null,"Summe",{"$f":"SUM(E414:E429)","v":0.73080000000000001}]
[]
["100116",{"$f":"'Ms&Extensions'!B13","v":"Multi Extension Air"},{"$f":"Products!B26","v":0},"0,4 A Netzt. Pro Ext.",null,null,"0,4A Netzteil",{"$f":"C432","v":0}]
[]
["200042",{"$f":"Products!D73","v":"5m RGB LED pásky IP20 (bez ochrany proti vodě)"},{"$f":"Products!B73","v":0},{"$f":"14.4*5/24","v":3},{"$f":"C434*D434","v":0}]
["200043",{"$f":"Products!D74","v":"5m LED pásky (teplá bílá) - IP20 (bez ochrany proti vodě)"},{"$f":"Products!B74","v":0},{"$f":"14.4*5/24","v":3},0,null,"4,2A Netzteil",{"$f":"IF((E451-H436*10)<10,ROUNDUP((E451-H436*10)/4.2,0),0)","v":1}]
["200045","RGB Streifen IP 65 - gelöscht",null,null,null,null,"10A Netzteil",{"$f":"ROUNDDOWN(E451/10,0)","v":2}]
["200046",{"$f":"Products!D75","v":"5m RGB LED pásky IP68 (proti potopení do vody)"},{"$f":"Products!B75","v":0},3,0]
["200061",{"$f":"Products!D82","v":"5m LED pásky (teplá bílá) - IP65 (proti tryskající vodě)"},{"$f":"Products!B82","v":0},{"$f":"14.4*5/24","v":3},0,null,null,null,"LED"]
["200092",{"$f":"Products!D93","v":"5m LED pásky (teplá bílá) - IP68 (proti potopení do vody)"},{"$f":"Products!B93","v":0},{"$f":"14.4*5/24","v":3},0,null,null,null,"Verfügbar",{"$f":"H435*4.2+H436*10","v":24.2}]
["200098",{"$f":"Products!D98","v":"5m RGBW LED pásky IP20 (bez ochrany proti vodě)"},{"$f":"Products!B98","v":4},3.6,14.4,null,null,null,"Benötigt",{"$f":"E451","v":21}]
["200099",{"$f":"Products!D99","v":"5m RGBW LED pásky IP65 (proti tryskající vodě)"},{"$f":"Products!B99","v":0},3.6,0]
["200100",{"$f":"Products!D100","v":"5m RGBW LED pásky IP68 (proti potopení do vody)"},{"$f":"Products!B100","v":0},3.6,0]
[100204,{"$f":"Products!D147","v":"LED Spot RGBW"},{"$f":"Products!B147","v":9},0.2,1.8]
[100203,{"$f":"Products!D148","v":"LED Spot WW"},{"$f":"Products!B148","v":24},0.2,4.8000000000000007]
[null,{"$f":"Light!B23","v":"Příložný LED Spot RGBW bílá"},{"$f":"Products!B180","v":0},0.39200000000000002,0]
[null,{"$f":"Light!B24","v":"Příložný LED Spot WW bílá"},{"$f":"Products!B181","v":0},0.39200000000000002,0]
[null,{"$f":"Light!B25","v":"Příložný LED Spot Tree RGBW bílá"},{"$f":"Products!B182","v":0},0.39200000000000002,0]
[null,{"$f":"Light!B26","v":"Příložný LED Spot Tree WW bílá"},{"$f":"Products!B183","v":0},0.39200000000000002,0]
[null,{"$f":"Light!B27","v":"LED Spot Tree WW bílá"},{"$f":"Products!B184","v":0},0.23,0]
[null,{"$f":"Light!B28","v":"LED Spot Tree RGBW bílá"},{"$f":"Products!B185","v":0},0.23,0]
[null,null,null,"Summe",{"$f":"SUM(E434:E450)","v":21}]
[]
["200003",{"$f":"Products!D57","v":"Venkovní senzor teploty"},{"$f":"Products!B57","v":0},5.0000000000000001E-3,{"$f":"C453*D453","v":0}]
["200004",{"$f":"Products!D58","v":"No longer sold"},{"$f":"Products!B58","v":0},4.2000000000000003E-2,0]
["200006",{"$f":"Products!D60","v":"Vnitřní teplotní senzor 0-10V"},{"$f":"Products!B60","v":0},5.0000000000000001E-3,0,null,"1,3A Netzteil",{"$f":"IF(E474>(H457*10+H456*4.2),ROUNDUP((E474-H457*10-H456*4.2)/1.3,0),0)","v":1}]
["200010",{"$f":"Products!D62","v":"Senzor teploty a vlhkosti (vnitřní) 0-10V"},{"$f":"Products!B62","v":0},5.0000000000000001E-3,0,null,"4,2A Netzteil",{"$f":"IF((E474-H457*10)<1.3,0,IF((E474>H457*10),ROUNDUP((E474-H457*10)/4.2,0),0))","v":0}]
["200017",{"$f":"Products!D65","v":"Senzor CO2/Teplota/Vlhkost"},{"$f":"Products!B65","v":0},0.01,0,null,"10A Netzteil",{"$f":"ROUNDDOWN(E474/10,0)","v":0}]
["200018",{"$f":"Products!D66","v":"Dešťový senzor (24V)"},{"$f":"Products!B66","v":0},{"$f":"0.06","v":0.06},0]
["200031",{"$f":"Products!D67","v":"Senzor teploty a vlhkosti (venkovní)"},{"$f":"Products!B67","v":0},5.0000000000000001E-3,0]
["200032",{"$f":"Products!D68","v":"Senzor osvětlení 0-10V"},{"$f":"Products!B68","v":0},{"$f":"0.005","v":5.0000000000000001E-3},0,null,null,null,"Pheriperie"]
[null,null,null,null,null,null,null,null,"Verfügbar",{"$f":"H455*1.3+H456*4.2+H457*10","v":1.3}]
["200054",{"$f":"Products!D79","v":"Ultrazvukový senzor 0-10V"},{"$f":"Products!B79","v":0},0.06,0,null,null,null,"Benötigt",{"$f":"E474","v":0.33760000000000001}]
["200112",{"$f":"Products!D105","v":"Senzor pohybu 24V (venkovní)"},{"$f":"Products!B105","v":2},1.4999999999999999E-2,0.03]
[200136,{"$f":"Products!D109","v":"Saunový senzor teplota/vlhkost"},{"$f":"Products!B109","v":0},5.0000000000000001E-3,0]
["200154",{"$f":"Products!D115","v":"Senzor tlaku 0-10V"},{"$f":"Products!B115","v":0},0.01,0]
[null,{"$f":"Products!D151","v":"Touch Tree bílá"},{"$f":"Products!B151","v":5},{"$f":"Products!O151","v":4.7999999999999996E-3},2.3999999999999997E-2]
[null,{"$f":"Products!D152","v":"Touch Tree anthrazit"},{"$f":"Products!B152","v":0},{"$f":"Products!O152","v":4.7999999999999996E-3},0]
[null,{"$f":"Products!D153","v":"Motion Sensor Tree bilá"},{"$f":"Products!B153","v":7},{"$f":"Products!O153","v":4.7999999999999996E-3},3.3599999999999998E-2]
[null,{"$f":"Products!D162","v":"Touch pure Air bílá"},{"$f":"Products!B162","v":0},0]
[null,{"$f":"Products!D163","v":"Touch pure for Nano bílá"},{"$f":"Products!B163","v":0},0]
[null,{"$f":"Products!D164","v":"Touch pure Tree bílá"},{"$f":"Products!B164","v":4}]
[null,{"$f":"Products!D154","v":"Hlavice Tree"},{"$f":"Products!B154","v":6},0.05,{"$f":"IF(C472/100>1,ROUNDUP(C472/100,0)*1,IF(C472>0,D472*5,0))","v":0.25}]
[]
[null,null,null,"Summe",{"$f":"SUM(E453:E472)","v":0.33760000000000001}]
[]
[]
[]
[]
[]
[null,"Platzbedarfsrechner","Anzahl","Platz","Gesamt"]
["100001",{"$f":"'Ms&Extensions'!B2","v":"Miniserver"},{"$f":"C414","v":1},155,{"$f":"C481*D481","v":155}]
["100002",{"$f":"'Ms&Extensions'!B3","v":"Extension"},0,155,{"$f":"C482*D482","v":0}]
["100011",{"$f":"'Ms&Extensions'!B4","v":"RS485 Extension"},0,34,0]
["100012",{"$f":"'Ms&Extensions'!B5","v":"DMX Extension"},0,34,0,null,"Gesamt in mm",{"$f":"E511","v":1201}]
["100013",{"$f":"'Ms&Extensions'!B6","v":"RS 232 Extension"},0,34,0,null,"Teilungseinh.",{"$f":"ROUNDUP(H484/17.2,0)","v":70}]
["100014",{"$f":"'Ms&Extensions'!B7","v":"1-Wire Extension"},0,34,0]
["100015",{"$f":"'Ms&Extensions'!B8","v":"Enocean Extension"},0,34,0]
["100029",{"$f":"'Ms&Extensions'!B10","v":"Dimmer Extension"},0,155,0]
["100035",{"$f":"Products!D22","v":"IR Set"},0,34,0]
["100038",{"$f":"'Ms&Extensions'!B11","v":"Relay Extension"},2,155,310]
["100114",{"$f":"'Ms&Extensions'!B12","v":"Air Base Extension"},1,34,34]
["100124",{"$f":"Products!D28","v":"Modbus Extension"},0,34,0]
["100158",{"$f":"'Ms&Extensions'!B15","v":"Fröling Extension"},0,35,0]
["200049",{"$f":"Products!D77","v":"Spojovací relé"},{"$f":"Products!B77","v":0},17,0]
["100117",{"$f":"Products!D27","v":"RGBW 24V Dimmer DMX"},{"$f":"Products!B27","v":0},34,0]
["200001",{"$f":"Products!D55","v":"24V Zdroj (1.3A)"},{"$f":"Products!B55","v":2},53,106]
["200002",{"$f":"Products!D56","v":"24V Zdroj (4.2A)"},{"$f":"Products!B56","v":1},90,90]
["200035",{"$f":"Products!D71","v":"24V Zdroj (10A)"},{"$f":"Products!B71","v":2},83,166]
["200143",{"$f":"Products!D111","v":"Zdroj 24V, 0,4A"},{"$f":"Products!B111","v":0},18,0]
["200156",{"$f":"Products!D117","v":"1-fázový elektroměr (Modbus)"},{"$f":"Products!B117","v":0},17.5,0]
["200157",{"$f":"Products!D118","v":"3-fázový elektroměr (Modbus)"},{"$f":"Products!B118","v":0},70,0]
["200168",{"$f":"Products!D120","v":"Svorka na DIN lištu PPV8 (20 kusů)"},{"$f":"Products!B120","v":0},120,0]
["200169",{"$f":"Products!D121","v":"Propojovací rozvaděč PRV8 (20 kusů)"},{"$f":"Products!B121","v":0},120,0]
["200173",{"$f":"Products!D125","v":"Svorka pro připojení motoru PMAK4 (50 kusů)"},{"$f":"Products!B125","v":0},104,0]
["200175",{"$f":"Products!D127","v":"Svorkovnice PDL (50 kusů)"},{"$f":"Products!B127","v":0},100,0]
["200178",{"$f":"Products!D130","v":"Pojistková svorkovnice (25 kusů)"},{"$f":"Products!B130","v":0},70,0]
[null,{"$f":"Products!D150","v":"Tree Extension"},{"$f":"Products!B150","v":1},34,34]
[null,{"$f":"Products!D160","v":"Dali Extension"},{"$f":"Products!B160","v":0},34,{"$f":"C508*D508","v":0}]
[null,{"$f":"Products!D186","v":"RGBW 24V Dimmer Tree"},{"$f":"Products!B186","v":9},34,{"$f":"C509*D509","v":306}]
[]
[null,"Gesamt",null,null,{"$f":"SUM(E481:E509)","v":1201}]
[null,"Dali Berechnung","Anzahl Channel",null,0,null,"zusätzliche Extension ?"]
[null,{"$f":"Light!B21","v":"Dali Channel"},{"$f":"IF(ISNA(VLOOKUP(B513,Main!$B$5:$C$14,2,FALSE)),0,VLOOKUP(B513,Main!$B$2:$C$14,2,FALSE))","v":0},null,0]
[null,null,null,null,0]
[null,null,null,null,1]
[null,null,null,null,0]
[null,null,null,null,0]
[null,"DMX Berechnung","Anzahl Geräte",null,"Summe dimmbar","AIR","nach Projekttyp entscheiden"]
[null,"LED Streifen IP20",{"$f":"Products!B98","v":4},null,0]
[null,"LED IP 65",{"$f":"Products!B99","v":0},null,0]
[null,"LED IP 68",{"$f":"Products!B100","v":0},null,1]
[null,"Spot WW",{"$f":"Products!B148","v":24},null,0]
[null,"Spot RGBW",{"$f":"Products!B147","v":9}]
[null,"LED WW IP65",{"$f":"Products!B82","v":0}]
[null,"LED RGB ip20",{"$f":"Products!B73","v":0}]
[null,"LED RGB IP68",{"$f":"Products!B75","v":0}]
[null,"DMX Dimmer",{"$f":"Products!B27","v":0},null,"DMX Extension Berechnung"]
[null,"Air Dimmer",{"$f":"Products!B29","v":0},null,{"$f":"ROUNDUP(C527/32,0)","v":0}]

{"sheet":"Translating_products","index":25,"n_rows":224,"n_cols":151,"rows_kept":224,"cut":false,"hidden":true,"merged":[[0,55,0,56],[0,0,0,1],[0,5,0,6],[0,10,0,11],[0,15,0,16],[0,20,0,21],[0,25,0,26],[0,30,0,31],[0,35,0,36],[0,40,0,41],[0,45,0,46],[0,50,0,51],[0,59,0,60],[0,64,0,65],[0,69,0,70],[0,74,0,75],[0,79,0,80]]}
["DE",null,"PRICES WITH A , not a . ",null,null,"EN_UK",null,null,null,null,"EN_US",null,null,null,null,"FR",null,null,null,null,"ES",null,null,null,null,"CZ",null,null,null,null,"IT",null,null,null,null,"CHE",null,null,null,null,"SK",null,null,null,null,"NL",null,null,null,null,"FI",null,null,null,null,"HU",null,null,null,"IE",null,null,null,null,"reserviert",null,null,null,null,"reserviert",null,null,null,null,"reserviert",null,null,null,null,"reserviert"]
[null,"Info: DO NOT CHANGE THE ORDER OF THE LIST ",null,null,null,null,"Info: DO NOT CHANGE THE ORDER OF THE LIST ",null,null,null,null,"Info: DO NOT CHANGE THE ORDER OF THE LIST ",null,null,null,null,"Info: DO NOT CHANGE THE ORDER OF THE LIST ",null,null,null,null,"Info: DO NOT CHANGE THE ORDER OF THE LIST ",null,null,null,null,"Info: DO NOT CHANGE THE ORDER OF THE LIST ",null,null,null,null,"Info: DO NOT CHANGE THE ORDER OF THE LIST ",null,null,null,null,"Info: DO NOT CHANGE THE ORDER OF THE LIST ",null,null,null,null,"Info: DO NOT CHANGE THE ORDER OF THE LIST ",null,null,null,null,"Info: DO NOT CHANGE THE ORDER OF THE LIST ",null,null,null,null,"Info: DO NOT CHANGE THE ORDER OF THE LIST ",null,null,null,null,"Info: DO NOT CHANGE THE ORDER OF THE LIST ",null,null,null,"Info: DO NOT CHANGE THE ORDER OF THE LIST ",null,null,null,null,"Info: DO NOT CHANGE THE ORDER OF THE LIST ",null,null,null,null,"Info: DO NOT CHANGE THE ORDER OF THE LIST ",null,null,null,null,"Info: DO NOT CHANGE THE ORDER OF THE LIST ",null,null,null,null,"Info: DO NOT CHANGE THE ORDER OF THE LIST ",null,null,null,null,"DO ","NOT",null,null,null,null,"Just for the easier use of the function"]
["Art. Nr.","Name","Netto",null,null,"Item Nr.","Name","excl. Taxes",null,null,"Item Nr.","Name","excl. Taxes",null,null,"Item Nr.","Name","excl. Taxes",null,null,"Item Nr.","Name","excl. Taxes",null,null,"Item Nr.","Name","excl. Taxes",null,null,"Item Nr.","Name","excl. Taxes",null,null,"Item Nr.","Name","excl. Taxes",null,null,"Item Nr.","Name","excl. Taxes",null,null,"Item Nr.","Name","excl. Taxes",null,null,"Item Nr.","Name","excl. Taxes",null,null,"Item Nr.","Name","excl. Taxes",null,"Item Nr.","Name","excl. Taxes",null,null,"Item Nr.","Name","excl. Taxes",null,null,"Item Nr.","Name","excl. Taxes",null,null,"Item Nr.","Name","excl. Taxes",null,null,"Item Nr.","Name","excl. Taxes",null,null,null,"CHANGE","HERE",null,null,null,"Zeilennr.",{"$f":"A3","v":"Art. Nr."},{"$f":"F3","v":"Item Nr."},{"$f":"K3","v":"Item Nr."},{"$f":"P3","v":"Item Nr."},{"$f":"U3","v":"Item Nr."},{"$f":"Z3","v":"Item Nr."},{"$f":"AE3","v":"Item Nr."},{"$f":"AJ3","v":"Item Nr."},{"$f":"AO3","v":"Item Nr."},{"$f":"AT3","v":"Item Nr."},{"$f":"AY3","v":"Item Nr."},{"$f":"BD3","v":"Item Nr."},{"$f":"BH3","v":"Item Nr."},{"$f":"BM3","v":"Item Nr."},{"$f":"BR3","v":"Item Nr."},{"$f":"BW3","v":"Item Nr."},{"$f":"CB3","v":"Item Nr."},null,null,null,null,{"$f":"B3","v":"Name"},{"$f":"G3","v":"Name"},{"$f":"L3","v":"Name"},{"$f":"Q3","v":"Name"},{"$f":"V3","v":"Name"},{"$f":"$AA$3","v":"Name"},{"$f":"$AF$3","v":"Name"},{"$f":"$AK$3","v":"Name"},{"$f":"$AP$3","v":"Name"},{"$f":"$AU$3","v":"Name"},{"$f":"$AZ$3","v":"Name"},{"$f":"$BE$3","v":"Name"},{"$f":"$BI$3","v":"Name"},{"$f":"$BN$3","v":"Name"},{"$f":"$BS$3","v":"Name"},{"$f":"$BX$3","v":"Name"},{"$f":"$CC$3","v":"Name"},null,null,null,null,null,{"$f":"C3","v":"Netto"},{"$f":"H3","v":"excl. Taxes"},{"$f":"M3","v":"excl. Taxes"},{"$f":"R3","v":"excl. Taxes"},{"$f":"W3","v":"excl. Taxes"},{"$f":"AB3","v":"excl. Taxes"},{"$f":"AG3","v":"excl. Taxes"},{"$f":"AL3","v":"excl. Taxes"},{"$f":"AQ3","v":"excl. Taxes"},{"$f":"AV3","v":"excl. Taxes"},{"$f":"BA3","v":"excl. Taxes"},{"$f":"BF3","v":"excl. Taxes"},{"$f":"BJ3","v":"excl. Taxes"},{"$f":"BO3","v":"excl. Taxes"},{"$f":"BT3","v":"excl. Taxes"},{"$f":"BY3","v":"excl. Taxes"},{"$f":"CD3","v":"excl. Taxes"}]
["DE","DE","DE","DE is just for",null,"EN_UK","EN_UK","EN_UK",null,null,"EN_US","EN_US","EN_US",null,null,"FR","FR","FR",null,null,"ES","ES","ES",null,null,"CZ","CZ","CZ",null,null,"IT","IT","IT",null,null,"CHE","CHE","CHE",null,null,"SK","SK","SK",null,null,"NL","NL","NL",null,null,"FI","FI","FI",null,null,"HU","HU","HU",null,"IE","IE","IE",null,null,"name = how you select it in the lookup",null,null,null,null,"name = how you select it in the lookup",null,null,null,null,"name = how you select it in the lookup",null,null,null,null,"name = how you select it in the lookup",null,null,null,null,null,null,null,null,null,null,1,{"$f":"A4","v":"DE"},{"$f":"F4","v":"EN_UK"},{"$f":"K4","v":"EN_US"},{"$f":"P4","v":"FR"},{"$f":"U4","v":"ES"},{"$f":"Z4","v":"CZ"},{"$f":"AE4","v":"IT"},{"$f":"AJ4","v":"CHE"},{"$f":"AO4","v":"SK"},{"$f":"AT4","v":"NL"},{"$f":"AY4","v":"FI"},{"$f":"BD4","v":"HU"},{"$f":"BH4","v":"IE"},{"$f":"BM4","v":"name = how you select it in the lookup"},{"$f":"BR4","v":"name = how you select it in the lookup"},{"$f":"BW4","v":"name = how you select it in the lookup"},{"$f":"CB4","v":"name = how you select it in the lookup"},null,null,null,null,{"$f":"B4","v":"DE"},{"$f":"G4","v":"EN_UK"},{"$f":"L4","v":"EN_US"},{"$f":"Q4","v":"FR"},{"$f":"V4","v":"ES"},{"$f":"AA4","v":"CZ"},{"$f":"AF4","v":"IT"},{"$f":"AK4","v":"CHE"},{"$f":"AP4","v":"SK"},{"$f":"AU4","v":"NL"},{"$f":"AZ4","v":"FI"},{"$f":"BE4","v":"HU"},{"$f":"BI4","v":"IE"},{"$f":"BN4","v":0},{"$f":"BS4","v":0},{"$f":"BX4","v":0},{"$f":"CC4","v":0},null,null,null,null,null,{"$f":"C4","v":"DE"},{"$f":"H4","v":"EN_UK"},{"$f":"M4","v":"EN_US"},{"$f":"R4","v":"FR"},{"$f":"W4","v":"ES"},{"$f":"AB4","v":"CZ"},{"$f":"AG4","v":"IT"},{"$f":"AL4","v":"CHE"},{"$f":"AQ4","v":"SK"},{"$f":"AV4","v":"NL"},{"$f":"BA4","v":"FI"},{"$f":"BF4","v":"HU"},{"$f":"BJ4","v":"IE"},{"$f":"BO4","v":0},{"$f":"BT4","v":0},{"$f":"BY4","v":0},{"$f":"CD4","v":0}]
[100001,"Miniserver",415,"lookup function",null,100001,"Miniserver",357.5,null,null,100001,"Miniserver",549,null,null,100001,"Miniserver",415,null,null,100001,"Miniserver",415,null,null,100001,"Miniserver",10329.75,null,null,100001,"Miniserver",415,null,null,100001,"Miniserver",489.82,null,null,100001,"Miniserver",415,null,null,100001,"Miniserver",415,null,null,"Not done","not translated yet","Not done",null,null,"Not done","not translated yet","Not done",null,"Not done","not translated yet","Not done",null,null,"Not done","not translated yet","Not done",null,null,"Not done","not translated yet","Not done",null,null,"Not done","not translated yet","Not done",null,null,"Not done","not translated yet","Not done",null,null,null,null,null,null,null,null,2,{"$f":"A5","v":100001},100001,{"$f":"K5","v":100001},{"$f":"P5","v":100001},{"$f":"U5","v":100001},{"$f":"Z5","v":100001},{"$f":"AE5","v":100001},{"$f":"AJ5","v":100001},{"$f":"AO5","v":100001},{"$f":"AT5","v":100001},{"$f":"AY5","v":"Not done"},{"$f":"BD5","v":"Not done"},{"$f":"BH5","v":"Not done"},{"$f":"BM5","v":"Not done"},{"$f":"BR5","v":"Not done"},{"$f":"BW5","v":"Not done"},{"$f":"CB5","v":"Not done"},null,null,null,null,{"$f":"B5","v":"Miniserver"},{"$f":"G5","v":"Miniserver"},{"$f":"L5","v":"Miniserver"},{"$f":"Q5","v":"Miniserver"},{"$f":"V5","v":"Miniserver"},{"$f":"AA5","v":"Miniserver"},{"$f":"AF5","v":"Miniserver"},{"$f":"AK5","v":"Miniserver"},{"$f":"AP5","v":"Miniserver"},{"$f":"AU5","v":"Miniserver"},{"$f":"AZ5","v":"not translated yet"},{"$f":"BE5","v":"not translated yet"},{"$f":"BI5","v":"not translated yet"},{"$f":"BN5","v":"not translated yet"},{"$f":"BS5","v":"not translated yet"},{"$f":"BX5","v":"not translated yet"},{"$f":"CC5","v":"not translated yet"},null,null,null,null,null,{"$f":"C5","v":415},{"$f":"H5","v":357.5},{"$f":"M5","v":549},{"$f":"R5","v":415},{"$f":"W5","v":415},{"$f":"AB5","v":10329.75},{"$f":"AG5","v":415},{"$f":"AL5","v":489.82},{"$f":"AQ5","v":415},{"$f":"AV5","v":415},{"$f":"BA5","v":"Not done"},{"$f":"BF5","v":"Not done"},{"$f":"BJ5","v":"Not done"},{"$f":"BO5","v":"Not done"},{"$f":"BT5","v":"Not done"},{"$f":"BY5","v":"Not done"},{"$f":"CD5","v":"Not done"}]
[100002,"Extension",331.67,null,null,100002,"Extension",282.5,null,null,100002,"Extension",449,null,null,100002,"Extension",331.67,null,null,100002,"Extension",331.67,null,null,100002,"Extension",8263.64,null,null,100002,"Extension",331.67,null,null,100002,"Extension",406.48,null,null,100002,"Extension",331.67,null,null,100002,"Extension",331.67,null,null,"Not done","not translated yet","Not done",null,null,"Not done","not translated yet","Not done",null,"Not done","not translated yet","Not done",null,null,"Not done","not translated yet","Not done",null,null,"Not done","not translated yet","Not done",null,null,"Not done","not translated yet","Not done",null,null,"Not done","not translated yet","Not done",null,null,null,null,null,null,null,null,3,100002,100002,100002,100002,100002,100002,100002,100002,100002,100002,"Not done","Not done","Not done","Not done","Not done","Not done","Not done",null,null,null,null,"Extension","Extension","Extension","Extension","Extension","Extension","Extension","Extension","Extension","Extension","not translated yet","not translated yet","not translated yet","not translated yet","not translated yet","not translated yet","not translated yet",null,null,null,null,null,331.67,282.5,449,331.67,331.67,8263.64,331.67,406.48,331.67,331.67,"Not done","Not done","Not done","Not done","Not done","Not done","Not done"]
[100004,"Rollup Aufsteller",190,null,null,100005,"Rollup Banner English",82.5,null,null,100005,"Rollup Banner English",119,null,null,100046,"Rollup FR",190,null,null,100004,"Rollup Loxone",190,null,null,100040,"Rollup český",2699,null,null,100004,"Rollup Espositore",190,null,null,100004,"Rollup Aufsteller",119.44,null,null,100040,"Rollup český",190,null,null,100042,"Rollup Banner Nederlands",190,null,null,"Not done","not translated yet","Not done",null,null,"Not done","not translated yet","Not done",null,"Not done","not translated yet","Not done",null,null,"Not done","not translated yet","Not done",null,null,"Not done","not translated yet","Not done",null,null,"Not done","not translated yet","Not done",null,null,"Not done","not translated yet","Not done",null,null,null,null,null,null,null,null,4,100004,100005,100005,100046,100004,100040,100004,100004,100040,100042,"Not done","Not done","Not done","Not done","Not done","Not done","Not done",null,null,null,null,"Rollup Aufsteller","Rollup Banner English","Rollup Banner English","Rollup FR","Rollup Loxone","Rollup český","Rollup Espositore","Rollup Aufsteller","Rollup český","Rollup Banner Nederlands","not translated yet","not translated yet","not translated yet","not translated yet","not translated yet","not translated yet","not translated yet",null,null,null,null,null,190,82.5,119,190,190,2699,190,119.44,190,190,"Not done","Not done","Not done","Not done","Not done","Not done","Not done"]
[100008,"SD-Karte mit Firmware",9.92,null,null,100008,"Micro SD Card with firmware",8.75,null,null,100008,"Micro SD Card with firmware",14,null,null,100008,"Micro SD Card avec firmware",9.92,null,null,100008,"Tarjeta SD con Firmware",9.92,null,null,100008,"SD-Karta s firmwarem",247.11,null,null,100008,"Scheda SD con Firmware",9.92,null,null,100008,"SD-Karte mit Firmware",11.99,null,null,100008,"SD-Karta s firmwarem",9.92,null,null,100008,"Micro SD Kaart met firmware",9.92,null,null,"Not done","not translated yet","Not done",null,null,"Not done","not translated yet","Not done",null,"Not done","not translated yet","Not done",null,null,"Not done","not translated yet","Not done",null,null,"Not done","not translated yet","Not done",null,null,"Not done","not translated yet","Not done",null,null,"Not done","not translated yet","Not done",null,null,null,null,null,null,null,null,5,100008,100008,100008,100008,100008,100008,100008,100008,100008,100008,"Not done","Not done","Not done","Not done","Not done","Not done","Not done",null,null,null,null,"SD-Karte mit Firmware","Micro SD Card with firmware","Micro SD Card with firmware","Micro SD Card avec firmware","Tarjeta SD con Firmware","SD-Karta s firmwarem","Scheda SD con Firmware","SD-Karte mit Firmware","SD-Karta s firmwarem","Micro SD Kaart met firmware","not translated yet","not translated yet","not translated yet","not translated yet","not translated yet","not translated yet","not translated yet",null,null,null,null,null,9.92,8.75,14,9.92,9.92,247.11,9.92,11.99,9.92,9.92,"Not done","Not done","Not done","Not done","Not done","Not done","Not done"]
[100011,"RS485 Extension",140.84,null,null,100011,"RS485 Extension",122.5,null,null,100011,"RS485 Extension",199,null,null,100011,"Extension RS485",140.84,null,null,100011,"RS485 Extension",140.84,null,null,100011,"RS485 Extension",3511.57,null,null,100011,"RS485 Extension",140.84,null,null,100011,"RS485 Extension",175,null,null,100011,"RS485 Extension",140.84,null,null,100011,"RS485 Extension",140.84,null,null,"Not done","not translated yet","Not done",null,null,"Not done","not translated yet","Not done",null,"Not done","not translated yet","Not done",null,null,"Not done","not translated yet","Not done",null,null,"Not done","not translated yet","Not done",null,null,"Not done","not translated yet","Not done",null,null,"Not done","not translated yet","Not done",null,null,null,null,null,null,null,null,6,100011,100011,100011,100011,100011,100011,100011,100011,100011,100011,"Not done","Not done","Not done","Not done","Not done","Not done","Not done",null,null,null,null,"RS485 Extension","RS485 Extension","RS485 Extension","Extension RS485","RS485 Extension","RS485 Extension","RS485 Extension","RS485 Extension","RS485 Extension","RS485 Extension","not translated yet","not translated yet","not translated yet","not translated yet","not translated yet","not translated yet","not translated yet",null,null,null,null,null,140.84,122.5,199,140.84,140.84,3511.57,140.84,175,140.84,140.84,"Not done","Not done","Not done","Not done","Not done","Not done","Not done"]
[100012,"DMX Extension",224.17,null,null,100012,"DMX Extension",197.5,null,null,100012,"DMX Extension",299,null,null,100012,"Extension DMX",224.17,null,null,100012,"DMX Extension",224.17,null,null,100012,"DMX Extension",5619.01,null,null,100012,"DMX Extension",224.17,null,null,100012,"DMX Extension",276.85000000000002,null,null,100012,"DMX Extension",224.17,null,null,100012,"DMX Extension",224.17,null,null,"Not done","not translated yet","Not done",null,null,"Not done","not translated yet","Not done",null,"Not done","not translated yet","Not done",null,null,"Not done","not translated yet","Not done",null,null,"Not done","not translated yet","Not done",null,null,"Not done","not translated yet","Not done",null,null,"Not done","not translated yet","Not done",null,null,null,null,null,null,null,null,7,100012,100012,100012,100012,100012,100012,100012,100012,100012,100012,"Not done","Not done","Not done","Not done","Not done","Not done","Not done",null,null,null,null,"DMX Extension","DMX Extension","DMX Extension","Extension DMX","DMX Extension","DMX Extension","DMX Extension","DMX Extension","DMX Extension","DMX Extension","not translated yet","not translated yet","not translated yet","not translated yet","not translated yet","not translated yet","not translated yet",null,null,null,null,null,224.17,197.5,299,224.17,224.17,5619.01,224.17,276.85000000000002,224.17,224.17,"Not done","Not done","Not done","Not done","Not done","Not done","Not done"]
[100013,"RS232 Extension",140.84,null,null,100013,"RS 232 Extension",122.5,null,null,100013,"RS 232 Extension",199,null,null,100013,"Extension RS 232",140.84,null,null,100013,"RS232 Extension",140.84,null,null,100013,"RS 232 Extension",3511.57,null,null,100013,"RS232 Extension",140.84,null,null,100013,"RS232 Extension",175,null,null,100013,"RS 232 Extension",140.84,null,null,100013,"RS 232 Extension",140.84,null,null,"Not done","not translated yet","Not done",null,null,"Not done","not translated yet","Not done",null,"Not done","not translated yet","Not done",null,null,"Not done","not translated yet","Not done",null,null,"Not done","not translated yet","Not done",null,null,"Not done","not translated yet","Not done",null,null,"Not done","not translated yet","Not done",null,null,null,null,null,null,null,null,8,100013,100013,100013,100013,100013,100013,100013,100013,100013,100013,"Not done","Not done","Not done","Not done","Not done","Not done","Not done",null,null,null,null,"RS232 Extension","RS 232 Extension","RS 232 Extension","Extension RS 232","RS232 Extension","RS 232 Extension","RS232 Extension","RS232 Extension","RS 232 Extension","RS 232 Extension","not translated yet","not translated yet","not translated yet","not translated yet","not translated yet","not translated yet","not translated yet",null,null,null,null,null,140.84,122.5,199,140.84,140.84,3511.57,140.84,175,140.84,140.84,"Not done","Not done","Not done","Not done","Not done","Not done","Not done"]
[100014,"1-wire Extension",140.84,null,null,100014,"1-Wire Extension",122.5,null,null,100014,"1-Wire Extension",199,null,null,100014,"Extension 1-Wire",140.84,null,null,100014,"1-wire Extension",140.84,null,null,100014,"1-Wire Extension",3511.57,null,null,100014,"1-wire Extension",140.84,null,null,100014,"1-wire Extension",175,null,null,100014,"1-Wire Extension",140.84,null,null,100014,"1-Wire Extension",140.84,null,null,"Not done","not translated yet","Not done",null,null,"Not done","not translated yet","Not done",null,"Not done","not translated yet","Not done",null,null,"Not done","not translated yet","Not done",null,null,"Not done","not translated yet","Not done",null,null,"Not done","not translated yet","Not done",null,null,"Not done","not translated yet","Not done",null,null,null,null,null,null,null,null,9,100014,100014,100014,100014,100014,100014,100014,100014,100014,100014,"Not done","Not done","Not done","Not done","Not done","Not done","Not done",null,null,null,null,"1-wire Extension","1-Wire Extension","1-Wire Extension","Extension 1-Wire","1-wire Extension","1-Wire Extension","1-wire Extension","1-wire Extension","1-Wire Extension","1-Wire Extension","not translated yet","not translated yet","not translated yet","not translated yet","not translated yet","not translated yet","not translated yet",null,null,null,null,null,140.84,122.5,199,140.84,140.84,3511.57,140.84,175,140.84,140.84,"Not done","Not done","Not done","Not done","Not done","Not done","Not done"]
[100015,"EnOcean Extension",249.17,null,null,100015,"Enocean Extension",212.5,null,null,"not available in this country","not available in this country",0,null,null,100015,"Extension Enocean",249.17,null,null,100015,"EnOcean Extension",249.17,null,null,100015,"Enocean Extension",6197.52,null,null,100015,"EnOcean Extension",249.17,null,null,100015,"EnOcean Extension",310.19,null,null,100015,"Enocean Extension",249.17,null,null,100015,"Enocean Extension",249.17,null,null,"Not done","not translated yet","Not done",null,null,"Not done","not translated yet","Not done",null,"Not done","not translated yet","Not done",null,null,"Not done","not translated yet","Not done",null,null,"Not done","not translated yet","Not done",null,null,"Not done","not translated yet","Not done",null,null,"Not done","not translated yet","Not done",null,null,null,null,null,null,null,null,10,100015,100015,"not available in this country",100015,100015,100015,100015,100015,100015,100015,"Not done","Not done","Not done","Not done","Not done","Not done","Not done",null,null,null,null,"EnOcean Extension","Enocean Extension","not available in this country","Extension Enocean","EnOcean Extension","Enocean Extension","EnOcean Extension","EnOcean Extension","Enocean Extension","Enocean Extension","not translated yet","not translated yet","not translated yet","not translated yet","not translated yet","not translated yet","not translated yet",null,null,null,null,null,249.17,212.5,0,249.17,249.17,6197.52,249.17,310.19,249.17,249.17,"Not done","Not done","Not done","Not done","Not done","Not done","Not done"]
[100023,"IR Module",65.83,null,null,0,"No longer sold",57.5,null,null,"No longer sold","No longer sold",0,null,null,100023,"IR Module",65.83,null,null,100023,"Módulo IR",65.83,null,null,0,"Neprodává se",null,null,null,100023,"Modulo IR",65.83,null,null,100023,"IR Module",88.84,null,null,0,"Neprodává se",65.83,null,null,100023,"IR Module",65.83,null,null,"Not done","not translated yet","Not done",null,null,"Not done","not translated yet","Not done",null,"Not done","not translated yet","Not done",null,null,"Not done","not translated yet","Not done",null,null,"Not done","not translated yet","Not done",null,null,"Not done","not translated yet","Not done",null,null,"Not done","not translated yet","Not done",null,null,null,null,null,null,null,null,11,100023,0,"No longer sold",100023,100023,0,100023,100023,0,100023,"Not done","Not done","Not done","Not done","Not done","Not done","Not done",null,null,null,null,"IR Module","No longer sold","No longer sold","IR Module","Módulo IR","Neprodává se","Modulo IR","IR Module","Neprodává se","IR Module","not translated yet","not translated yet","not translated yet","not translated yet","not translated yet","not translated yet","not translated yet",null,null,null,null,null,65.83,57.5,0,65.83,65.83,0,65.83,88.84,65.83,65.83,"Not done","Not done","Not done","Not done","Not done","Not done","Not done"]
[100025,"Cloud Weather 1 Jahr",49.92,null,null,100025,"Weather Service 1 Year",42.5,null,null,100025,"Weather Service 1 Year",69,null,null,100025,"Service météo 1 an",49.92,null,null,100025,"Servico Meteorológico 1 año",49.92,null,null,100025,"Weather Service 1 rok",1238.8399999999999,null,null,100025,"Cloud Weather 1 anno",49.92,null,null,100025,"Cloud Weather 1 Jahr",64.77,null,null,100025,"Weather Service 1 rok",49.92,null,null,100025,"Weather Service 1 Jaar",49.92,null,null,"Not done","not translated yet","Not done",null,null,"Not done","not translated yet","Not done",null,"Not done","not translated yet","Not done",null,null,"Not done","not translated yet","Not done",null,null,"Not done","not translated yet","Not done",null,null,"Not done","not translated yet","Not done",null,null,"Not done","not translated yet","Not done",null,null,null,null,null,null,null,null,12,100025,100025,100025,100025,100025,100025,100025,100025,100025,100025,"Not done","Not done","Not done","Not done","Not done","Not done","Not done",null,null,null,null,"Cloud Weather 1 Jahr","Weather Service 1 Year","Weather Service 1 Year","Service météo 1 an","Servico Meteorológico 1 año","Weather Service 1 rok","Cloud Weather 1 anno","Cloud Weather 1 Jahr","Weather Service 1 rok","Weather Service 1 Jaar","not translated yet","not translated yet","not translated yet","not translated yet","not translated yet","not translated yet","not translated yet",null,null,null,null,null,49.92,42.5,69,49.92,49.92,1238.8399999999999,49.92,64.77,49.92,49.92,"Not done","Not done","Not done","Not done","Not done","Not done","Not done"]
[100201,"Cloud Weather 10 Jahre",290.83,null,null,100201,"Weather Service 10 Year",240,null,null,100201,"Weather Service 10 Year",325,null,null,100201,"Service météo 10 ans",279.2,null,null,100201,"Servico Meteorológico 10 años",279.2,null,null,100201,"Weather Service 10 let",7899,null,null,100201,"Cloud Weather 10 anno",279.2,null,null,100201,"Cloud Weather 10 Jahre",369.44,null,null,100201,"Weather Service 10 let",279.2,null,null,100201,"Weather Service 10 Jaar",279.2,null,null,"Not done","not translated yet","Not done",null,null,"Not done","not translated yet","Not done",null,"Not done","not translated yet","Not done",null,null,"Not done","not translated yet","Not done",null,null,"Not done","not translated yet","Not done",null,null,"Not done","not translated yet","Not done",null,null,"Not done","not translated yet","Not done",null,null,null,null,null,null,null,null,13,100201,100201,100201,100201,100201,100201,100201,100201,100201,100201,"Not done","Not done","Not done","Not done","Not done","Not done","Not done",null,null,null,null,"Cloud Weather 10 Jahre","Weather Service 10 Year","Weather Service 10 Year","Service météo 10 ans","Servico Meteorológico 10 años","Weather Service 10 let","Cloud Weather 10 anno","Cloud Weather 10 Jahre","Weather Service 10 let","Weather Service 10 Jaar","not translated yet","not translated yet","not translated yet","not translated yet","not translated yet","not translated yet","not translated yet",null,null,null,null,null,290.83,240,325,279.2,279.2,7899,279.2,369.44,279.2,279.2,"Not done","Not done","Not done","Not done","Not done","Not done","Not done"]
[100027,"Cloud Caller 1 Jahr",49.92,null,null,100027,"Caller Service 1 Year",47.5,null,null,100027,"Caller Service 1 Year",69,null,null,100027,"Caller Service 1 an",49.92,null,null,100027,"Servicio de Llamadas 1 año",49.92,null,null,100027,"Caller Service 1 rok",1238.8399999999999,null,null,100027,"Cloud Caller 1 anno",49.92,null,null,100027,"Cloud Caller 1 Jahr",64.77,null,null,100027,"Caller Service 1 rok",49.92,null,null,100027,"Caller Service 1 Jaar",49.92,null,null,"Not done","not translated yet","Not done",null,null,"Not done","not translated yet","Not done",null,"Not done","not translated yet","Not done",null,null,"Not done","not translated yet","Not done",null,null,"Not done","not translated yet","Not done",null,null,"Not done","not translated yet","Not done",null,null,"Not done","not translated yet","Not done",null,null,null,null,null,null,null,null,14,100027,100027,100027,100027,100027,100027,100027,100027,100027,100027,"Not done","Not done","Not done","Not done","Not done","Not done","Not done",null,null,null,null,"Cloud Caller 1 Jahr","Caller Service 1 Year","Caller Service 1 Year","Caller Service 1 an","Servicio de Llamadas 1 año","Caller Service 1 rok","Cloud Caller 1 anno","Cloud Caller 1 Jahr","Caller Service 1 rok","Caller Service 1 Jaar","not translated yet","not translated yet","not translated yet","not translated yet","not translated yet","not translated yet","not translated yet",null,null,null,null,null,49.92,47.5,69,49.92,49.92,1238.8399999999999,49.92,64.77,49.92,49.92,"Not done","Not done","Not done","Not done","Not done","Not done","Not done"]
[100202,"Cloud Caller 10 Jahre",290.83,null,null,100028,"Caller Service 10 Years",240,null,null,100028,"Caller Service 10 Years",325,null,null,100028,"Caller Service 3 ans",290.83,null,null,100028,"Servicio de Llamadas 10 años",290.83,null,null,100028,"Caller Service 10 let",7899,null,null,100028,"Cloud Caller 3 anni",141.59,null,null,100028,"Cloud Caller 3 Jahre",165.74,null,null,100028,"Caller Service 10 let",279.2,null,null,100028,"Caller Service 3 Jaar",141.59,null,null,"Not done","not translated yet","Not done",null,null,"Not done","not translated yet","Not done",null,"Not done","not translated yet","Not done",null,null,"Not done","not translated yet","Not done",null,null,"Not done","not translated yet","Not done",null,null,"Not done","not translated yet","Not done",null,null,"Not done","not translated yet","Not done",null,null,null,null,null,null,null,null,15,100202,100028,100028,100028,100028,100028,100028,100028,100028,100028,"Not done","Not done","Not done","Not done","Not done","Not done","Not done",null,null,null,null,"Cloud Caller 10 Jahre","Caller Service 10 Years","Caller Service 10 Years","Caller Service 3 ans","Servicio de Llamadas 10 años","Caller Service 10 let","Cloud Caller 3 anni","Cloud Caller 3 Jahre","Caller Service 10 let","Caller Service 3 Jaar","not translated yet","not translated yet","not translated yet","not translated yet","not translated yet","not translated yet","not translated yet",null,null,null,null,null,290.83,240,325,290.83,290.83,7899,141.59,165.74,279.2,141.59,"Not done","Not done","Not done","Not done","Not done","Not done","Not done"]
[100029,"Dimmer Extension",373.33,null,null,100029,"Dimmer Extension",322.5,null,null,100029,"Dimmer Extension",499,null,null,100029,"Extension Dimmer",373.33,null,null,100029,"Dimmer Extension",373.33,null,null,100029,"Dimmer Extension",9338.02,null,null,100029,"Dimmer Extension",373.33,null,null,100029,"Dimmer Extension",452.78,null,null,100029,"Dimmer Extension",373.33,null,null,100029,"Dimmer Extension",373.33,null,null,"Not done","not translated yet","Not done",null,null,"Not done","not translated yet","Not done",null,"Not done","not translated yet","Not done",null,null,"Not done","not translated yet","Not done",null,null,"Not done","not translated yet","Not done",null,null,"Not done","not translated yet","Not done",null,null,"Not done","not translated yet","Not done",null,null,null,null,null,null,null,null,16,100029,100029,100029,100029,100029,100029,100029,100029,100029,100029,"Not done","Not done","Not done","Not done","Not done","Not done","Not done",null,null,null,null,"Dimmer Extension","Dimmer Extension","Dimmer Extension","Extension Dimmer","Dimmer Extension","Dimmer Extension","Dimmer Extension","Dimmer Extension","Dimmer Extension","Dimmer Extension","not translated yet","not translated yet","not translated yet","not translated yet","not translated yet","not translated yet","not translated yet",null,null,null,null,null,373.33,322.5,499,373.33,373.33,9338.02,373.33,452.78,373.33,373.33,"Not done","Not done","Not done","Not done","Not done","Not done","Not done"]
[0,"No longer sold",0,null,null,0,"No longer sold",147.5,null,null,100035,"IR Set",229,null,null,100035,"Kit IR",165.83,null,null,100035,"IR Set",165.83,null,null,100035,"IR Set",4131.3999999999996,null,null,100035,"IR Set",165.83,null,null,100035,"IR Set",221.3,null,null,100035,"IR Set",165.83,null,null,100035,"IR Set",165.83,null,null,"Not done","not translated yet","Not done",null,null,"Not done","not translated yet","Not done",null,"Not done","not translated yet","Not done",null,null,"Not done","not translated yet","Not done",null,null,"Not done","not translated yet","Not done",null,null,"Not done","not translated yet","Not done",null,null,"Not done","not translated yet","Not done",null,null,null,null,null,null,null,null,17,0,0,100035,100035,100035,100035,100035,100035,100035,100035,"Not done","Not done","Not done","Not done","Not done","Not done","Not done",null,null,null,null,"No longer sold","No longer sold","IR Set","Kit IR","IR Set","IR Set","IR Set","IR Set","IR Set","IR Set","not translated yet","not translated yet","not translated yet","not translated yet","not translated yet","not translated yet","not translated yet",null,null,null,null,null,0,147.5,229,165.83,165.83,4131.3999999999996,165.83,221.3,165.83,165.83,"Not done","Not done","Not done","Not done","Not done","Not done","Not done"]
[100038,"Relay Extension",395,null,null,100038,"Relay Extension",332.5,null,null,100038,"Relay Extension",539,null,null,100038,"Extension Relay",395,null,null,100038,"Relay Extension",395,null,null,100038,"Relay Extension",9916.5300000000007,null,null,100038,"Relay Extension",395,null,null,100038,"Relay Extension",489.82,null,null,100038,"Relay Extension",395,null,null,100038,"Relay Extension",395,null,null,"Not done","not translated yet","Not done",null,null,"Not done","not translated yet","Not done",null,"Not done","not translated yet","Not done",null,null,"Not done","not translated yet","Not done",null,null,"Not done","not translated yet","Not done",null,null,"Not done","not translated yet","Not done",null,null,"Not done","not translated yet","Not done",null,null,null,null,null,null,null,null,18,100038,100038,100038,100038,100038,100038,100038,100038,100038,100038,"Not done","Not done","Not done","Not done","Not done","Not done","Not done",null,null,null,null,"Relay Extension","Relay Extension","Relay Extension","Extension Relay","Relay Extension","Relay Extension","Relay Extension","Relay Extension","Relay Extension","Relay Extension","not translated yet","not translated yet","not translated yet","not translated yet","not translated yet","not translated yet","not translated yet",null,null,null,null,null,395,332.5,539,395,395,9916.5300000000007,395,489.82,395,395,"Not done","Not done","Not done","Not done","Not done","Not done","Not done"]
[100114,"Air Base Extension",82.5,null,null,100114,"Air Base Extension",72.5,null,null,100114,"Air Base Extension",113,null,null,100114,"Extension Air Base",82.5,null,null,100114,"Air Base Extension",82.5,null,null,100114,"Air Base Extension",2099,null,null,100114,"Air Base Extension",82.5,null,null,100114,"Air Base Extension",100.93,null,null,100114,"Air Base Extension",82.5,null,null,100114,"Air Base Extension",82.5,null,null,"Not done","not translated yet","Not done",null,null,"Not done","not translated yet","Not done",null,"Not done","not translated yet","Not done",null,null,"Not done","not translated yet","Not done",null,null,"Not done","not translated yet","Not done",null,null,"Not done","not translated yet","Not done",null,null,"Not done","not translated yet","Not done",null,null,null,null,null,null,null,null,19,100114,100114,100114,100114,100114,100114,100114,100114,100114,100114,"Not done","Not done","Not done","Not done","Not done","Not done","Not done",null,null,null,null,"Air Base Extension","Air Base Extension","Air Base Extension","Extension Air Base","Air Base Extension","Air Base Extension","Air Base Extension","Air Base Extension","Air Base Extension","Air Base Extension","not translated yet","not translated yet","not translated yet","not translated yet","not translated yet","not translated yet","not translated yet",null,null,null,null,null,82.5,72.5,113,82.5,82.5,2099,82.5,100.93,82.5,82.5,"Not done","Not done","Not done","Not done","Not done","Not done","Not done"]
[100115,"Smart Socket Air - Typ F AT",58.25,null,null,100121,"Smart Socket Air - Type G (UK)",50,null,null,"not available in this country","not available in this country",0,null,null,100120,"Smart Socket Air - Type E (FR)",58.25,null,null,100115,"Smart Socket Air - Tipo F ES",58.25,null,null,100120,"Smart Socket Air Typ E",1499,null,null,100115,"Smart Socket Air - Typ F AT",58.25,null,null,100119,"Smart Socket Air - Typ J (CH, LI)",74.03,null,null,100120,"Smart Socket Air Typ E",58.25,null,null,100120,"Smart Socket Air BE Type E - NL Type F (100115)",58.25,null,null,"Not done","not translated yet","Not done",null,null,"Not done","not translated yet","Not done",null,"Not done","not translated yet","Not done",null,null,"Not done","not translated yet","Not done",null,null,"Not done","not translated yet","Not done",null,null,"Not done","not translated yet","Not done",null,null,"Not done","not translated yet","Not done",null,null,null,null,null,null,null,null,20,100115,100121,"not available in this country",100120,100115,100120,100115,100119,100120,100120,"Not done","Not done","Not done","Not done","Not done","Not done","Not done",null,null,null,null,"Smart Socket Air - Typ F AT","Smart Socket Air - Type G (UK)","not available in this country","Smart Socket Air - Type E (FR)","Smart Socket Air - Tipo F ES","Smart Socket Air Typ E","Smart Socket Air - Typ F AT","Smart Socket Air - Typ J (CH, LI)","Smart Socket Air Typ E","Smart Socket Air BE Type E - NL Type F (100115)","not translated yet","not translated yet","not translated yet","not translated yet","not translated yet","not translated yet","not translated yet",null,null,null,null,null,58.25,50,0,58.25,58.25,1499,58.25,74.03,58.25,58.25,"Not done","Not done","Not done","Not done","Not done","Not done","Not done"]
[100116,"Multi Extension Air",395,null,null,100116,"Multi Extension Air",332.5,null,null,100116,"Multi Extension Air",539,null,null,100116,"Multi Extension Air",395,null,null,100116,"Multi Extension Air",395,null,null,100116,"Multi Extension Air",9916.5300000000007,null,null,100116,"Multi Extension Air",395,null,null,100116,"Multi Extension Air",489.82,null,null,100116,"Multi Extension Air",395,null,null,100116,"Multi Extension Air",395,null,null,"Not done","not translated yet","Not done",null,null,"Not done","not translated yet","Not done",null,"Not done","not translated yet","Not done",null,null,"Not done","not translated yet","Not done",null,null,"Not done","not translated yet","Not done",null,null,"Not done","not translated yet","Not done",null,null,"Not done","not translated yet","Not done",null,null,null,null,null,null,null,null,21,100116,100116,100116,100116,100116,100116,100116,100116,100116,100116,"Not done","Not done","Not done","Not done","Not done","Not done","Not done",null,null,null,null,"Multi Extension Air","Multi Extension Air","Multi Extension Air","Multi Extension Air","Multi Extension Air","Multi Extension Air","Multi Extension Air","Multi Extension Air","Multi Extension Air","Multi Extension Air","not translated yet","not translated yet","not translated yet","not translated yet","not translated yet","not translated yet","not translated yet",null,null,null,null,null,395,332.5,539,395,395,9916.5300000000007,395,489.82,395,395,"Not done","Not done","Not done","Not done","Not done","Not done","Not done"]
[100117,"RGBW 24V Dimmer DMX",59.9,null,null,100117,"RGBW 24V Dimmer DMX",55,null,null,100117,"RGBW 24V Dimmer DMX",82,null,null,100117,"RGBW 24V Dimmer DMX",59.9,null,null,100117,"Dimmer DMX RGBW 24V",59.9,null,null,100117,"RGBW 24V Dimmer DMX",1499,null,null,100117,"RGBW 24V Dimmer DMX",59.9,null,null,100117,"RGBW 24V Dimmer DMX",74.03,null,null,100117,"RGBW 24V Dimmer DMX",59.9,null,null,100117,"RGBW 24V Dimmer DMX",59.9,null,null,"Not done","not translated yet","Not done",null,null,"Not done","not translated yet","Not done",null,"Not done","not translated yet","Not done",null,null,"Not done","not translated yet","Not done",null,null,"Not done","not translated yet","Not done",null,null,"Not done","not translated yet","Not done",null,null,"Not done","not translated yet","Not done",null,null,null,null,null,null,null,null,22,100117,100117,100117,100117,100117,100117,100117,100117,100117,100117,"Not done","Not done","Not done","Not done","Not done","Not done","Not done",null,null,null,null,"RGBW 24V Dimmer DMX","RGBW 24V Dimmer DMX","RGBW 24V Dimmer DMX","RGBW 24V Dimmer DMX","Dimmer DMX RGBW 24V","RGBW 24V Dimmer DMX","RGBW 24V Dimmer DMX","RGBW 24V Dimmer DMX","RGBW 24V Dimmer DMX","RGBW 24V Dimmer DMX","not translated yet","not translated yet","not translated yet","not translated yet","not translated yet","not translated yet","not translated yet",null,null,null,null,null,59.9,55,82,59.9,59.9,1499,59.9,74.03,59.9,59.9,"Not done","Not done","Not done","Not done","Not done","Not done","Not done"]
[100124,"Modbus Extension",190,null,null,100124,"Modbus Extension",165,null,null,100124,"Modbus Extension",255,null,null,100124,"Extension Modbus",190,null,null,100124,"Modbus Extension",190,null,null,100124,"Modbus Extension",4799,null,null,100124,"Modbus Extension",190,null,null,100124,"Modbus Extension",230.56,null,null,100124,"Modbus Extension",190,null,null,100124,"Modbus Extension",190,null,null,"Not done","not translated yet","Not done",null,null,"Not done","not translated yet","Not done",null,"Not done","not translated yet","Not done",null,null,"Not done","not translated yet","Not done",null,null,"Not done","not translated yet","Not done",null,null,"Not done","not translated yet","Not done",null,null,"Not done","not translated yet","Not done",null,null,null,null,null,null,null,null,23,100124,100124,100124,100124,100124,100124,100124,100124,100124,100124,"Not done","Not done","Not done","Not done","Not done","Not done","Not done",null,null,null,null,"Modbus Extension","Modbus Extension","Modbus Extension","Extension Modbus","Modbus Extension","Modbus Extension","Modbus Extension","Modbus Extension","Modbus Extension","Modbus Extension","not translated yet","not translated yet","not translated yet","not translated yet","not translated yet","not translated yet","not translated yet",null,null,null,null,null,190,165,255,190,190,4799,190,230.56,190,190,"Not done","Not done","Not done","Not done","Not done","Not done","Not done"]
[100125,"RGBW 24V Dimmer Air",69.900000000000006,null,null,100125,"RGBW 24V Dimmer Air",62.5,null,null,100125,"RGBW 24V Dimmer Air",96,null,null,100125,"RGBW 24V Dimmer Air",69.900000000000006,null,null,100125,"Dimmer Air RGBW 24V",69.900000000000006,null,null,100125,"RGBW 24V Dimmer Air",1849,null,null,100125,"RGBW 24V Dimmer Air",69.900000000000006,null,null,100125,"RGBW 24V Dimmer Air",83.29,null,null,100125,"RGBW 24V Dimmer Air",69.900000000000006,null,null,100125,"RGBW 24V Dimmer Air",69.900000000000006,null,null,"Not done","not translated yet","Not done",null,null,"Not done","not translated yet","Not done",null,"Not done","not translated yet","Not done",null,null,"Not done","not translated yet","Not done",null,null,"Not done","not translated yet","Not done",null,null,"Not done","not translated yet","Not done",null,null,"Not done","not translated yet","Not done",null,null,null,null,null,null,null,null,24,100125,100125,100125,100125,100125,100125,100125,100125,100125,100125,"Not done","Not done","Not done","Not done","Not done","Not done","Not done",null,null,null,null,"RGBW 24V Dimmer Air","RGBW 24V Dimmer Air","RGBW 24V Dimmer Air","RGBW 24V Dimmer Air","Dimmer Air RGBW 24V","RGBW 24V Dimmer Air","RGBW 24V Dimmer Air","RGBW 24V Dimmer Air","RGBW 24V Dimmer Air","RGBW 24V Dimmer Air","not translated yet","not translated yet","not translated yet","not translated yet","not translated yet","not translated yet","not translated yet",null,null,null,null,null,69.900000000000006,62.5,96,69.900000000000006,69.900000000000006,1849,69.900000000000006,83.29,69.900000000000006,69.900000000000006,"Not done","Not done","Not done","Not done","Not done","Not done","Not done"]
[100139,"Miniserver Go",299,null,null,100139,"Miniserver Go",247.5,null,null,100139,"Miniserver Go",349,null,null,100139,"Miniserver Go",299,null,null,100139,"Miniserver Go",299,null,null,100139,"Miniserver Go",8263.6299999999992,null,null,100139,"Miniserver Go",299,null,null,100139,"Miniserver Go",369.44,null,null,100139,"Miniserver Go",299,null,null,100139,"Miniserver Go",299,null,null,"Not done","not translated yet","Not done",null,null,"Not done","not translated yet","Not done",null,"Not done","not translated yet","Not done",null,null,"Not done","not translated yet","Not done",null,null,"Not done","not translated yet","Not done",null,null,"Not done","not translated yet","Not done",null,null,"Not done","not translated yet","Not done",null,null,null,null,null,null,null,null,25,100139,100139,100139,100139,100139,100139,100139,100139,100139,100139,"Not done","Not done","Not done","Not done","Not done","Not done","Not done",null,null,null,null,"Miniserver Go","Miniserver Go","Miniserver Go","Miniserver Go","Miniserver Go","Miniserver Go","Miniserver Go","Miniserver Go","Miniserver Go","Miniserver Go","not translated yet","not translated yet","not translated yet","not translated yet","not translated yet","not translated yet","not translated yet",null,null,null,null,null,299,247.5,349,299,299,8263.6299999999992,299,369.44,299,299,"Not done","Not done","Not done","Not done","Not done","Not done","Not done"]
[100140,"Remote Air",41,null,null,100140,"Remote Air",35,null,null,100140,"Remote Air",55.5,null,null,100140,"Remote Air",41,null,null,100140,"Remote Air",41,null,null,100140,"Remote Air",1099,null,null,100140,"Remote Air",41,null,null,100140,"Remote Air",49.95,null,null,100140,"Remote Air",41,null,null,100140,"Remote Air",41,null,null,"Not done","not translated yet","Not done",null,null,"Not done","not translated yet","Not done",null,"Not done","not translated yet","Not done",null,null,"Not done","not translated yet","Not done",null,null,"Not done","not translated yet","Not done",null,null,"Not done","not translated yet","Not done",null,null,"Not done","not translated yet","Not done",null,null,null,null,null,null,null,null,26,100140,100140,100140,100140,100140,100140,100140,100140,100140,100140,"Not done","Not done","Not done","Not done","Not done","Not done","Not done",null,null,null,null,"Remote Air","Remote Air","Remote Air","Remote Air","Remote Air","Remote Air","Remote Air","Remote Air","Remote Air","Remote Air","not translated yet","not translated yet","not translated yet","not translated yet","not translated yet","not translated yet","not translated yet",null,null,null,null,null,41,35,55.5,41,41,1099,41,49.95,41,41,"Not done","Not done","Not done","Not done","Not done","Not done","Not done"]
[100141,"IR Control Air",89,null,null,100141,"IR Control Air",77.5,null,null,100141,"IR Control Air",124.9,null,null,100141,"IR Control Air",89,null,null,100141,"IR Control Air",89,null,null,100141,"IR Control Air",2499,null,null,100141,"IR Control Air",89,null,null,100141,"IR Control Air",110.19,null,null,100141,"IR Control Air",89,null,null,100141,"IR Control Air",89,null,null,"Not done","not translated yet","Not done",null,null,"Not done","not translated yet","Not done",null,"Not done","not translated yet","Not done",null,null,"Not done","not translated yet","Not done",null,null,"Not done","not translated yet","Not done",null,null,"Not done","not translated yet","Not done",null,null,"Not done","not translated yet","Not done",null,null,null,null,null,null,null,null,27,100141,100141,100141,100141,100141,100141,100141,100141,100141,100141,"Not done","Not done","Not done","Not done","Not done","Not done","Not done",null,null,null,null,"IR Control Air","IR Control Air","IR Control Air","IR Control Air","IR Control Air","IR Control Air","IR Control Air","IR Control Air","IR Control Air","IR Control Air","not translated yet","not translated yet","not translated yet","not translated yet","not translated yet","not translated yet","not translated yet",null,null,null,null,null,89,77.5,124.9,89,89,2499,89,110.19,89,89,"Not done","Not done","Not done","Not done","Not done","Not done","Not done"]
[100142,"Smoke Detector Air",75,null,null,100142,"Smoke Detector Air",65,null,null,100142,"Smoke Detector Air",99,null,null,100142,"Détecteur de Fumée Air",75,null,null,100142,"Detector de humo Air",75,null,null,100142,"Detektor kouře Air",2049,null,null,100142,"Smoke Detector Air",75,null,null,100142,"Smoke Detector Air",89.77,null,null,100142,"Detektor kouře Air",75,null,null,100142,"Smoke Detector Air",75,null,null,"Not done","not translated yet","Not done",null,null,"Not done","not translated yet","Not done",null,"Not done","not translated yet","Not done",null,null,"Not done","not translated yet","Not done",null,null,"Not done","not translated yet","Not done",null,null,"Not done","not translated yet","Not done",null,null,"Not done","not translated yet","Not done",null,null,null,null,null,null,null,null,28,100142,100142,100142,100142,100142,100142,100142,100142,100142,100142,"Not done","Not done","Not done","Not done","Not done","Not done","Not done",null,null,null,null,"Smoke Detector Air","Smoke Detector Air","Smoke Detector Air","Détecteur de Fumée Air","Detector de humo Air","Detektor kouře Air","Smoke Detector Air","Smoke Detector Air","Detektor kouře Air","Smoke Detector Air","not translated yet","not translated yet","not translated yet","not translated yet","not translated yet","not translated yet","not translated yet",null,null,null,null,null,75,65,99,75,75,2049,75,89.77,75,75,"Not done","Not done","Not done","Not done","Not done","Not done","Not done"]
[100149,"Temperatur & Feuchtefühler Air",69,null,null,100149,"Temperature & Humidity Sesnor Air",57.5,null,null,100149,"Temperature & Humidity Sesnor Air",79,null,null,100149,"Sonde de Température et humidité Air",69,null,null,100149,"Sensor de temperatura y humedad Air",69,null,null,100149,"Senzor teploty & vlhkosti Air",1899,null,null,100149,"Sensore temperatura & umidità Air",69,null,null,100149,"Temperatur & Feuchtefühler Air",86.99,null,null,100149,"Senzor teploty & vlhkosti Air",69,null,null,100149,"Temperatuur & Vochtigheidsvoeler Air",69,null,null,"Not done","not translated yet","Not done",null,null,"Not done","not translated yet","Not done",null,"Not done","not translated yet","Not done",null,null,"Not done","not translated yet","Not done",null,null,"Not done","not translated yet","Not done",null,null,"Not done","not translated yet","Not done",null,null,"Not done","not translated yet","Not done",null,null,null,null,null,null,null,null,29,100149,100149,100149,100149,100149,100149,100149,100149,100149,100149,"Not done","Not done","Not done","Not done","Not done","Not done","Not done",null,null,null,null,"Temperatur & Feuchtefühler Air","Temperature & Humidity Sesnor Air","Temperature & Humidity Sesnor Air","Sonde de Température et humidité Air","Sensor de temperatura y humedad Air","Senzor teploty & vlhkosti Air","Sensore temperatura & umidità Air","Temperatur & Feuchtefühler Air","Senzor teploty & vlhkosti Air","Temperatuur & Vochtigheidsvoeler Air","not translated yet","not translated yet","not translated yet","not translated yet","not translated yet","not translated yet","not translated yet",null,null,null,null,null,69,57.5,79,69,69,1899,69,86.99,69,69,"Not done","Not done","Not done","Not done","Not done","Not done","Not done"]
[100150,"Werkzeug-Set by Weidmüller",305,null,null,100150,"Loxone Tool Kit by Weidmüller",257.5,null,null,100150,"Loxone Tool Kit by Weidmüller",339,null,null,100150,"Loxone Tool Kit by Weidmüller",305,null,null,100150,"Estuche de herramientas by Weidmüller",305,null,null,100150,"Loxone set nářadí",8399,null,null,100150,"Set atrezzi by Weidmüller",305,null,null,100150,"Werkzeug-Set by Weidmüller",397.22,null,null,100150,"Loxone set nářadí",305,null,null,100150,"Loxone Tool Kit van Weidmüller",305,null,null,"Not done","not translated yet","Not done",null,null,"Not done","not translated yet","Not done",null,"Not done","not translated yet","Not done",null,null,"Not done","not translated yet","Not done",null,null,"Not done","not translated yet","Not done",null,null,"Not done","not translated yet","Not done",null,null,"Not done","not translated yet","Not done",null,null,null,null,null,null,null,null,30,100150,100150,100150,100150,100150,100150,100150,100150,100150,100150,"Not done","Not done","Not done","Not done","Not done","Not done","Not done",null,null,null,null,"Werkzeug-Set by Weidmüller","Loxone Tool Kit by Weidmüller","Loxone Tool Kit by Weidmüller","Loxone Tool Kit by Weidmüller","Estuche de herramientas by Weidmüller","Loxone set nářadí","Set atrezzi by Weidmüller","Werkzeug-Set by Weidmüller","Loxone set nářadí","Loxone Tool Kit van Weidmüller","not translated yet","not translated yet","not translated yet","not translated yet","not translated yet","not translated yet","not translated yet",null,null,null,null,null,305,257.5,339,305,305,8399,305,397.22,305,305,"Not done","Not done","Not done","Not done","Not done","Not done","Not done"]
[100151,"Loxone Zählerinterface IR Air",89,null,null,100151,"Loxone Meter Reader IR Air",77.5,null,null,"not available in this country","not available in this country",0,null,null,100151,"Controleur IR Air",89,null,null,100151,"Contador IR Air Loxone",89,null,null,100151,"IR Elektroměr Air",2099,null,null,100151,"Loxone contatore interface IR Air",89,null,null,100151,"Loxone Zählerinterface IR Air",119.44,null,null,"not available in this country","not available in this country",0,null,null,100151,"Loxone Tellerinterface IR AIR",89,null,null,"Not done","not translated yet","Not done",null,null,"Not done","not translated yet","Not done",null,"Not done","not translated yet","Not done",null,null,"Not done","not translated yet","Not done",null,null,"Not done","not translated yet","Not done",null,null,"Not done","not translated yet","Not done",null,null,"Not done","not translated yet","Not done",null,null,null,null,null,null,null,null,31,100151,100151,"not available in this country",100151,100151,100151,100151,100151,"not available in this country",100151,"Not done","Not done","Not done","Not done","Not done","Not done","Not done",null,null,null,null,"Loxone Zählerinterface IR Air","Loxone Meter Reader IR Air","not available in this country","Controleur IR Air","Contador IR Air Loxone","IR Elektroměr Air","Loxone contatore interface IR Air","Loxone Zählerinterface IR Air","not available in this country","Loxone Tellerinterface IR AIR","not translated yet","not translated yet","not translated yet","not translated yet","not translated yet","not translated yet","not translated yet",null,null,null,null,null,89,77.5,0,89,89,2099,89,119.44,0,89,"Not done","Not done","Not done","Not done","Not done","Not done","Not done"]
[100153,"Nano IO Air",92,null,null,100153,"Nano IO Air",75,null,null,100153,"Nano IO Air",119,null,null,100153,"Nano IO Air",92,null,null,100153,"Nano IO Air",92,null,null,100153,"Nano IO Air",2499,null,null,100153,"Nano IO Air",92,null,null,100153,"Nano IO Air",110.19,null,null,100153,"Nano IO Air",92,null,null,100153,"Nano IO Air",92,null,null,"Not done","not translated yet","Not done",null,null,"Not done","not translated yet","Not done",null,"Not done","not translated yet","Not done",null,null,"Not done","not translated yet","Not done",null,null,"Not done","not translated yet","Not done",null,null,"Not done","not translated yet","Not done",null,null,"Not done","not translated yet","Not done",null,null,null,null,null,null,null,null,32,100153,100153,100153,100153,100153,100153,100153,100153,100153,100153,"Not done","Not done","Not done","Not done","Not done","Not done","Not done",null,null,null,null,"Nano IO Air","Nano IO Air","Nano IO Air","Nano IO Air","Nano IO Air","Nano IO Air","Nano IO Air","Nano IO Air","Nano IO Air","Nano IO Air","not translated yet","not translated yet","not translated yet","not translated yet","not translated yet","not translated yet","not translated yet",null,null,null,null,null,92,75,119,92,92,2499,92,110.19,92,92,"Not done","Not done","Not done","Not done","Not done","Not done","Not done"]
[100154,"Loxone Touch for Nano Weiß",39,null,null,100154,"Loxone Touch for Nano White",30,null,null,100154,"Loxone Touch for Nano White",49,null,null,100154,"Loxone Touch pour Nano Blanc",39,null,null,100154,"Loxone Touch para Nano blanco",39,null,null,100154,"Loxone Touch for Nano Bílá",1049,null,null,100154,"Loxone Touch for Nano bianco",39,null,null,100154,"Loxone Touch for Nano Weiß",49.03,null,null,100154,"Loxone Touch for Nano Bílá",39,null,null,100154,"Loxone Touch for Nano Wit",39,null,null,"Not done","not translated yet","Not done",null,null,"Not done","not translated yet","Not done",null,"Not done","not translated yet","Not done",null,null,"Not done","not translated yet","Not done",null,null,"Not done","not translated yet","Not done",null,null,"Not done","not translated yet","Not done",null,null,"Not done","not translated yet","Not done",null,null,null,null,null,null,null,null,33,100154,100154,100154,100154,100154,100154,100154,100154,100154,100154,"Not done","Not done","Not done","Not done","Not done","Not done","Not done",null,null,null,null,"Loxone Touch for Nano Weiß","Loxone Touch for Nano White","Loxone Touch for Nano White","Loxone Touch pour Nano Blanc","Loxone Touch para Nano blanco","Loxone Touch for Nano Bílá","Loxone Touch for Nano bianco","Loxone Touch for Nano Weiß","Loxone Touch for Nano Bílá","Loxone Touch for Nano Wit","not translated yet","not translated yet","not translated yet","not translated yet","not translated yet","not translated yet","not translated yet",null,null,null,null,null,39,30,49,39,39,1049,39,49.03,39,39,"Not done","Not done","Not done","Not done","Not done","Not done","Not done"]
[100155,"Loxone Touch Air Weiß",89,null,null,100155,"Loxone Touch Air White",72.5,null,null,100155,"Loxone Touch Air White",124,null,null,100155,"Loxone Touch Air Blanc",89,null,null,100155,"Loxone Touch Air blanco",89,null,null,100155,"Loxone Touch Air Bílá",2499,null,null,100155,"Loxone Touch Air bianco",89,null,null,100155,"Loxone Touch Air Weiß",110.19,null,null,100155,"Loxone Touch Air Bílá",89,null,null,100155,"Loxone Touch Air Wit",89,null,null,"Not done","not translated yet","Not done",null,null,"Not done","not translated yet","Not done",null,"Not done","not translated yet","Not done",null,null,"Not done","not translated yet","Not done",null,null,"Not done","not translated yet","Not done",null,null,"Not done","not translated yet","Not done",null,null,"Not done","not translated yet","Not done",null,null,null,null,null,null,null,null,34,100155,100155,100155,100155,100155,100155,100155,100155,100155,100155,"Not done","Not done","Not done","Not done","Not done","Not done","Not done",null,null,null,null,"Loxone Touch Air Weiß","Loxone Touch Air White","Loxone Touch Air White","Loxone Touch Air Blanc","Loxone Touch Air blanco","Loxone Touch Air Bílá","Loxone Touch Air bianco","Loxone Touch Air Weiß","Loxone Touch Air Bílá","Loxone Touch Air Wit","not translated yet","not translated yet","not translated yet","not translated yet","not translated yet","not translated yet","not translated yet",null,null,null,null,null,89,72.5,124,89,89,2499,89,110.19,89,89,"Not done","Not done","Not done","Not done","Not done","Not done","Not done"]
[100158,"Fröling Extension",165.83,null,null,100158,"Fröling Extension",147.5,null,null,"not available in this country","not available in this country",0,null,null,100158,"Extension Fröling",165.83,null,null,100158,"Fröling Extension",165.83,null,null,100158,"Fröling Extension",4499,null,null,100158,"Fröling Extension",165.83,null,null,100158,"Fröling Extension",202.78,null,null,100158,"Fröling Extension",165.83,null,null,100158,"Fröling Extension",165.83,null,null,"Not done","not translated yet","Not done",null,null,"Not done","not translated yet","Not done",null,"Not done","not translated yet","Not done",null,null,"Not done","not translated yet","Not done",null,null,"Not done","not translated yet","Not done",null,null,"Not done","not translated yet","Not done",null,null,"Not done","not translated yet","Not done",null,null,null,null,null,null,null,null,35,100158,100158,"not available in this country",100158,100158,100158,100158,100158,100158,100158,"Not done","Not done","Not done","Not done","Not done","Not done","Not done",null,null,null,null,"Fröling Extension","Fröling Extension","not available in this country","Extension Fröling","Fröling Extension","Fröling Extension","Fröling Extension","Fröling Extension","Fröling Extension","Fröling Extension","not translated yet","not translated yet","not translated yet","not translated yet","not translated yet","not translated yet","not translated yet",null,null,null,null,null,165.83,147.5,0,165.83,165.83,4499,165.83,202.78,165.83,165.83,"Not done","Not done","Not done","Not done","Not done","Not done","Not done"]
[100163,"Stellantrieb Air",78,null,null,100163,"Valve Actuator Air",60,null,null,100163,"Valve Actuator Air",86,null,null,100163,"Tête Thermostatique Air",78,null,null,100163,"Actuador válvula Air",78,null,null,100163,"Hlavice Air",2099,null,null,100163,"Valvola termica Air",78,null,null,100163,"Stellantrieb Air",100.93,null,null,100163,"Hlavice Air",78,null,null,100163,"Stelventiel Air",78,null,null,"Not done","not translated yet","Not done",null,null,"Not done","not translated yet","Not done",null,"Not done","not translated yet","Not done",null,null,"Not done","not translated yet","Not done",null,null,"Not done","not translated yet","Not done",null,null,"Not done","not translated yet","Not done",null,null,"Not done","not translated yet","Not done",null,null,null,null,null,null,null,null,36,100163,100163,100163,100163,100163,100163,100163,100163,100163,100163,"Not done","Not done","Not done","Not done","Not done","Not done","Not done",null,null,null,null,"Stellantrieb Air","Valve Actuator Air","Valve Actuator Air","Tête Thermostatique Air","Actuador válvula Air","Hlavice Air","Valvola termica Air","Stellantrieb Air","Hlavice Air","Stelventiel Air","not translated yet","not translated yet","not translated yet","not translated yet","not translated yet","not translated yet","not translated yet",null,null,null,null,null,78,60,86,78,78,2099,78,100.93,78,78,"Not done","Not done","Not done","Not done","Not done","Not done","Not done"]
[100165,"Loxone Music Server 4",1150,null,null,100165,"Loxone Music Server 4 Zone",982.5,null,null,100165,"Loxone Music Server 4 Zone",1249,null,null,100165,"Loxone Music Server 4 Zones",1150,null,null,100165,"Loxone Music Server 4 zonas",1150,null,null,100165,"Loxone Music Server 4 Zóny",31999,null,null,100165,"Loxone Music Server 4",1150,null,null,100165,"Loxone Music Server 4",1443.52,null,null,100165,"Loxone Music Server 4 Zóny",1150,null,null,100165,"Loxone Music Server 4 Zones",1150,null,null,"Not done","not translated yet","Not done",null,null,"Not done","not translated yet","Not done",null,"Not done","not translated yet","Not done",null,null,"Not done","not translated yet","Not done",null,null,"Not done","not translated yet","Not done",null,null,"Not done","not translated yet","Not done",null,null,"Not done","not translated yet","Not done",null,null,null,null,null,null,null,null,37,100165,100165,100165,100165,100165,100165,100165,100165,100165,100165,"Not done","Not done","Not done","Not done","Not done","Not done","Not done",null,null,null,null,"Loxone Music Server 4","Loxone Music Server 4 Zone","Loxone Music Server 4 Zone","Loxone Music Server 4 Zones","Loxone Music Server 4 zonas","Loxone Music Server 4 Zóny","Loxone Music Server 4","Loxone Music Server 4","Loxone Music Server 4 Zóny","Loxone Music Server 4 Zones","not translated yet","not translated yet","not translated yet","not translated yet","not translated yet","not translated yet","not translated yet",null,null,null,null,null,1150,982.5,1249,1150,1150,31999,1150,1443.52,1150,1150,"Not done","Not done","Not done","Not done","Not done","Not done","Not done"]
[100166,"Loxone Music Server 8",1699,null,null,100166,"Loxone Music Server 8 Zone",1457.5,null,null,100166,"Loxone Music Server 8 Zone",1849,null,null,100166,"Loxone Music Server 8 Zones",1699,null,null,100166,"Loxone Music Server 8 zonas",1699,null,null,100166,"Loxone Music Server 8 Zón",44999,null,null,100166,"Loxone Music Server 8",1699,null,null,100166,"Loxone Music Server 8",2128.6999999999998,null,null,100166,"Loxone Music Server 8 Zón",1699,null,null,100166,"Loxone Music Server 8 Zones",1699,null,null,"Not done","not translated yet","Not done",null,null,"Not done","not translated yet","Not done",null,"Not done","not translated yet","Not done",null,null,"Not done","not translated yet","Not done",null,null,"Not done","not translated yet","Not done",null,null,"Not done","not translated yet","Not done",null,null,"Not done","not translated yet","Not done",null,null,null,null,null,null,null,null,38,100166,100166,100166,100166,100166,100166,100166,100166,100166,100166,"Not done","Not done","Not done","Not done","Not done","Not done","Not done",null,null,null,null,"Loxone Music Server 8","Loxone Music Server 8 Zone","Loxone Music Server 8 Zone","Loxone Music Server 8 Zones","Loxone Music Server 8 zonas","Loxone Music Server 8 Zón","Loxone Music Server 8","Loxone Music Server 8","Loxone Music Server 8 Zón","Loxone Music Server 8 Zones","not translated yet","not translated yet","not translated yet","not translated yet","not translated yet","not translated yet","not translated yet",null,null,null,null,null,1699,1457.5,1849,1699,1699,44999,1699,2128.6999999999998,1699,1699,"Not done","Not done","Not done","Not done","Not done","Not done","Not done"]
[100167,"Loxone Music Server 12",1999,null,null,100167,"Loxone Music Server 12 Zone",1707.5,null,null,100167,"Loxone Music Server 12 Zone",2099,null,null,100167,"Loxone Music Server 12 Zones",1999,null,null,100167,"Loxone Music Server 12 zonas",1999,null,null,100167,"Loxone Music Server 12 Zón",52499,null,null,100167,"Loxone Music Server 12",1999,null,null,100167,"Loxone Music Server 12",2499.0700000000002,null,null,100167,"Loxone Music Server 12 Zón",1999,null,null,100167,"Loxone Music Server 12 Zones",1999,null,null,"Not done","not translated yet","Not done",null,null,"Not done","not translated yet","Not done",null,"Not done","not translated yet","Not done",null,null,"Not done","not translated yet","Not done",null,null,"Not done","not translated yet","Not done",null,null,"Not done","not translated yet","Not done",null,null,"Not done","not translated yet","Not done",null,null,null,null,null,null,null,null,39,100167,100167,100167,100167,100167,100167,100167,100167,100167,100167,"Not done","Not done","Not done","Not done","Not done","Not done","Not done",null,null,null,null,"Loxone Music Server 12","Loxone Music Server 12 Zone","Loxone Music Server 12 Zone","Loxone Music Server 12 Zones","Loxone Music Server 12 zonas","Loxone Music Server 12 Zón","Loxone Music Server 12","Loxone Music Server 12","Loxone Music Server 12 Zón","Loxone Music Server 12 Zones","not translated yet","not translated yet","not translated yet","not translated yet","not translated yet","not translated yet","not translated yet",null,null,null,null,null,1999,1707.5,2099,1999,1999,52499,1999,2499.0700000000002,1999,1999,"Not done","Not done","Not done","Not done","Not done","Not done","Not done"]
[100168,"Loxone Music Server 16",2499,null,null,100168,"Loxone Music Server 16 Zone",2132.5,null,null,100168,"Loxone Music Server 16 Zone",2649,null,null,100168,"Loxone Music Server 16 Zones",2499,null,null,100168,"Loxone Music Server 16 zonas",2499,null,null,100168,"Loxone Music Server 16 Zón",64999,null,null,100168,"Loxone Music Server 16",2499,null,null,100168,"Loxone Music Server 16",3147.22,null,null,100168,"Loxone Music Server 16 Zón",2499,null,null,100168,"Loxone Music Server 16 Zones",2499,null,null,"Not done","not translated yet","Not done",null,null,"Not done","not translated yet","Not done",null,"Not done","not translated yet","Not done",null,null,"Not done","not translated yet","Not done",null,null,"Not done","not translated yet","Not done",null,null,"Not done","not translated yet","Not done",null,null,"Not done","not translated yet","Not done",null,null,null,null,null,null,null,null,40,100168,100168,100168,100168,100168,100168,100168,100168,100168,100168,"Not done","Not done","Not done","Not done","Not done","Not done","Not done",null,null,null,null,"Loxone Music Server 16","Loxone Music Server 16 Zone","Loxone Music Server 16 Zone","Loxone Music Server 16 Zones","Loxone Music Server 16 zonas","Loxone Music Server 16 Zón","Loxone Music Server 16","Loxone Music Server 16","Loxone Music Server 16 Zón","Loxone Music Server 16 Zones","not translated yet","not translated yet","not translated yet","not translated yet","not translated yet","not translated yet","not translated yet",null,null,null,null,null,2499,2132.5,2649,2499,2499,64999,2499,3147.22,2499,2499,"Not done","Not done","Not done","Not done","Not done","Not done","Not done"]
[100169,"Loxone Music Server 20",2799,null,null,100169,"Loxone Music Server 20 Zone",2382.5,null,null,100169,"Loxone Music Server 20 Zone",2999,null,null,100169,"Loxone Music Server 20 Zones",2799,null,null,100169,"Loxone Music Server 20 zonas",2799,null,null,100169,"Loxone Music Server 20 Zón",74999,null,null,100169,"Loxone Music Server 20",2799,null,null,100169,"Loxone Music Server 20",3517.59,null,null,100169,"Loxone Music Server 20 Zón",2799,null,null,100169,"Loxone Music Server 20 Zones",2799,null,null,"Not done","not translated yet","Not done",null,null,"Not done","not translated yet","Not done",null,"Not done","not translated yet","Not done",null,null,"Not done","not translated yet","Not done",null,null,"Not done","not translated yet","Not done",null,null,"Not done","not translated yet","Not done",null,null,"Not done","not translated yet","Not done",null,null,null,null,null,null,null,null,41,100169,100169,100169,100169,100169,100169,100169,100169,100169,100169,"Not done","Not done","Not done","Not done","Not done","Not done","Not done",null,null,null,null,"Loxone Music Server 20","Loxone Music Server 20 Zone","Loxone Music Server 20 Zone","Loxone Music Server 20 Zones","Loxone Music Server 20 zonas","Loxone Music Server 20 Zón","Loxone Music Server 20","Loxone Music Server 20","Loxone Music Server 20 Zón","Loxone Music Server 20 Zones","not translated yet","not translated yet","not translated yet","not translated yet","not translated yet","not translated yet","not translated yet",null,null,null,null,null,2799,2382.5,2999,2799,2799,74999,2799,3517.59,2799,2799,"Not done","Not done","Not done","Not done","Not done","Not done","Not done"]
[100170,"Loxone Tischaufsteller",39,null,null,"NA","not available in this country",0,null,null,"not available in this country","not available in this country",0,null,null,"not available in this country","not available in this country",null,null,null,"not available in this country","not available in this country",0,"NO AVAIABLE IN LOXONE SHOP ES",null,"not available in this country","not available in this country",0,null,null,100170,"Loxone espositore da tavolo",39,null,null,100170,"Loxone Tischaufsteller",50.88,null,null,"not available in this country","not available in this country",0,null,null,100170,"Loxone tafeldisplay",39,null,null,"Not done","not translated yet","Not done",null,null,"Not done","not translated yet","Not done",null,"Not done","not translated yet","Not done",null,null,"Not done","not translated yet","Not done",null,null,"Not done","not translated yet","Not done",null,null,"Not done","not translated yet","Not done",null,null,"Not done","not translated yet","Not done",null,null,null,null,null,null,null,null,42,100170,"NA","not available in this country","not available in this country","not available in this country","not available in this country",100170,100170,"not available in this country",100170,"Not done","Not done","Not done","Not done","Not done","Not done","Not done",null,null,null,null,"Loxone Tischaufsteller","not available in this country","not available in this country","not available in this country","not available in this country","not available in this country","Loxone espositore da tavolo","Loxone Tischaufsteller","not available in this country","Loxone tafeldisplay","not translated yet","not translated yet","not translated yet","not translated yet","not translated yet","not translated yet","not translated yet",null,null,null,null,null,39,0,0,0,0,0,39,50.88,0,39,"Not done","Not done","Not done","Not done","Not done","Not done","Not done"]
[100178,"AquaStar Air 1,5\"",1400,null,null,100178,"AquaStar Air 1.5\"",1187.5,null,null,100178,"AquaStar Air 1.5\"",1549,null,null,100178,"AquaStar Air 1.5\"",1400,null,null,100178,"AquaStar Air 1,5\"",1400,null,null,100178,"AquaStar Air 1.5\"",38999,null,null,100178,"AquaStar Air 1,5\"",1400,null,null,100178,"AquaStar Air 1,5\"",1823.14,null,null,100178,"AquaStar Air 1.5\"",1400,null,null,100178,"AquaStar Air 1.5\"",1400,null,null,"Not done","not translated yet","Not done",null,null,"Not done","not translated yet","Not done",null,"Not done","not translated yet","Not done",null,null,"Not done","not translated yet","Not done",null,null,"Not done","not translated yet","Not done",null,null,"Not done","not translated yet","Not done",null,null,"Not done","not translated yet","Not done",null,null,null,null,null,null,null,null,43,100178,100178,100178,100178,100178,100178,100178,100178,100178,100178,"Not done","Not done","Not done","Not done","Not done","Not done","Not done",null,null,null,null,"AquaStar Air 1,5\"","AquaStar Air 1.5\"","AquaStar Air 1.5\"","AquaStar Air 1.5\"","AquaStar Air 1,5\"","AquaStar Air 1.5\"","AquaStar Air 1,5\"","AquaStar Air 1,5\"","AquaStar Air 1.5\"","AquaStar Air 1.5\"","not translated yet","not translated yet","not translated yet","not translated yet","not translated yet","not translated yet","not translated yet",null,null,null,null,null,1400,1187.5,1549,1400,1400,38999,1400,1823.14,1400,1400,"Not done","Not done","Not done","Not done","Not done","Not done","Not done"]
[100179,"AquaStar Air 2\"",1500,null,null,100179,"AquaStar Air 2\"",1272.5,null,null,100179,"AquaStar Air 2\"",1649,null,null,100179,"AquaStar Air 2\"",1500,null,null,100179,"AquaStar Air 2\"",1500,null,null,100179,"AquaStar Air 2\"",51999,null,null,100179,"AquaStar Air 2\"",1500,null,null,100179,"AquaStar Air 2\"",1943.51,null,null,100179,"AquaStar Air 2\"",1500,null,null,100179,"AquaStar Air 2\"",1500,null,null,"Not done","not translated yet","Not done",null,null,"Not done","not translated yet","Not done",null,"Not done","not translated yet","Not done",null,null,"Not done","not translated yet","Not done",null,null,"Not done","not translated yet","Not done",null,null,"Not done","not translated yet","Not done",null,null,"Not done","not translated yet","Not done",null,null,null,null,null,null,null,null,44,100179,100179,100179,100179,100179,100179,100179,100179,100179,100179,"Not done","Not done","Not done","Not done","Not done","Not done","Not done",null,null,null,null,"AquaStar Air 2\"","AquaStar Air 2\"","AquaStar Air 2\"","AquaStar Air 2\"","AquaStar Air 2\"","AquaStar Air 2\"","AquaStar Air 2\"","AquaStar Air 2\"","AquaStar Air 2\"","AquaStar Air 2\"","not translated yet","not translated yet","not translated yet","not translated yet","not translated yet","not translated yet","not translated yet",null,null,null,null,null,1500,1272.5,1649,1500,1500,51999,1500,1943.51,1500,1500,"Not done","Not done","Not done","Not done","Not done","Not done","Not done"]
[100180,"Loxone Touch Air Anthrazit",89,null,null,100180,"Loxone Touch Air Anthracite",72.5,null,null,100180,"Loxone Touch Air Anthracite",124,null,null,100180,"Loxone Touch Air Anthracite",89,null,null,100180,"Loxone Touch Air Antracita",89,null,null,100180,"Loxone Touch Air Anthrazit",2499,null,null,100180,"Loxone Touch Air antracite",89,null,null,100180,"Loxone Touch Air Anthrazit",110.19,null,null,100180,"Loxone Touch Air Anthrazit",89,null,null,100180,"Loxone Touch Air Anthraciet",89,null,null,"Not done","not translated yet","Not done",null,null,"Not done","not translated yet","Not done",null,"Not done","not translated yet","Not done",null,null,"Not done","not translated yet","Not done",null,null,"Not done","not translated yet","Not done",null,null,"Not done","not translated yet","Not done",null,null,"Not done","not translated yet","Not done",null,null,null,null,null,null,null,null,45,100180,100180,100180,100180,100180,100180,100180,100180,100180,100180,"Not done","Not done","Not done","Not done","Not done","Not done","Not done",null,null,null,null,"Loxone Touch Air Anthrazit","Loxone Touch Air Anthracite","Loxone Touch Air Anthracite","Loxone Touch Air Anthracite","Loxone Touch Air Antracita","Loxone Touch Air Anthrazit","Loxone Touch Air antracite","Loxone Touch Air Anthrazit","Loxone Touch Air Anthrazit","Loxone Touch Air Anthraciet","not translated yet","not translated yet","not translated yet","not translated yet","not translated yet","not translated yet","not translated yet",null,null,null,null,null,89,72.5,124,89,89,2499,89,110.19,89,89,"Not done","Not done","Not done","Not done","Not done","Not done","Not done"]
[100181,"Loxone Touch for Nano Anthrazit",39,null,null,100181,"Loxone Touch for Nano Anthracite",30,null,null,100181,"Loxone Touch for Nano Anthracite",49,null,null,100181,"Loxone Touch pour Nano Anthracite",39,null,null,100181,"Loxone Touch para Nano Antracita",39,null,null,100181,"Loxone Touch for Nano Anthrazit",1049,null,null,100181,"Loxone Touch for Nano antracite",39,null,null,100181,"Loxone Touch for Nano Anthrazit",49.03,null,null,100181,"Loxone Touch for Nano Anthrazit",39,null,null,100181,"Loxone Touch for Nano Anthraciet",39,null,null,"Not done","not translated yet","Not done",null,null,"Not done","not translated yet","Not done",null,"Not done","not translated yet","Not done",null,null,"Not done","not translated yet","Not done",null,null,"Not done","not translated yet","Not done",null,null,"Not done","not translated yet","Not done",null,null,"Not done","not translated yet","Not done",null,null,null,null,null,null,null,null,46,100181,100181,100181,100181,100181,100181,100181,100181,100181,100181,"Not done","Not done","Not done","Not done","Not done","Not done","Not done",null,null,null,null,"Loxone Touch for Nano Anthrazit","Loxone Touch for Nano Anthracite","Loxone Touch for Nano Anthracite","Loxone Touch pour Nano Anthracite","Loxone Touch para Nano Antracita","Loxone Touch for Nano Anthrazit","Loxone Touch for Nano antracite","Loxone Touch for Nano Anthrazit","Loxone Touch for Nano Anthrazit","Loxone Touch for Nano Anthraciet","not translated yet","not translated yet","not translated yet","not translated yet","not translated yet","not translated yet","not translated yet",null,null,null,null,null,39,30,49,39,39,1049,39,49.03,39,39,"Not done","Not done","Not done","Not done","Not done","Not done","Not done"]
[100182,"Geiger SOLIDline Air 10Nm",165,null,null,100182,"Tubular Motor SOLIDline Air 10Nm",130,null,null,"not available in this country","not available in this country",0,null,null,100182,"Moteur SOLIDline Air 10Nm",165,null,null,100182,"Motor persiana SOLIDline Air 10Nm",165,null,null,100182,"Trubkový Motor SOLIDline Air 10Nm",4499,null,null,100182,"Geiger SOLIDline Air 10Nm",165,null,null,100182,"Geiger SOLIDline Air 10Nm",202.78,null,null,100182,"Trubkový Motor SOLIDline Air 10Nm",165,null,null,100182,"Tubular Motor SOLIDline Air 10Nm",165,null,null,"Not done","not translated yet","Not done",null,null,"Not done","not translated yet","Not done",null,"Not done","not translated yet","Not done",null,null,"Not done","not translated yet","Not done",null,null,"Not done","not translated yet","Not done",null,null,"Not done","not translated yet","Not done",null,null,"Not done","not translated yet","Not done",null,null,null,null,null,null,null,null,47,100182,100182,"not available in this country",100182,100182,100182,100182,100182,100182,100182,"Not done","Not done","Not done","Not done","Not done","Not done","Not done",null,null,null,null,"Geiger SOLIDline Air 10Nm","Tubular Motor SOLIDline Air 10Nm","not available in this country","Moteur SOLIDline Air 10Nm","Motor persiana SOLIDline Air 10Nm","Trubkový Motor SOLIDline Air 10Nm","Geiger SOLIDline Air 10Nm","Geiger SOLIDline Air 10Nm","Trubkový Motor SOLIDline Air 10Nm","Tubular Motor SOLIDline Air 10Nm","not translated yet","not translated yet","not translated yet","not translated yet","not translated yet","not translated yet","not translated yet",null,null,null,null,null,165,130,0,165,165,4499,165,202.78,165,165,"Not done","Not done","Not done","Not done","Not done","Not done","Not done"]
[100183,"Geiger SOLIDline Air 20Nm",185,null,null,100183,"Tubular Motor SOLIDline Air 20Nm",145,null,null,"not available in this country","not available in this country",0,null,null,100183,"Moteurr SOLIDline Air 20Nm",185,null,null,100183,"Motor persiana SOLIDline Air 20Nm",185,null,null,100183,"Trubkový Motor SOLIDline Air 20Nm",4999,null,null,100183,"Geiger SOLIDline Air 20Nm",185,null,null,100183,"Geiger SOLIDline Air 20Nm",230.56,null,null,100183,"Trubkový Motor SOLIDline Air 20Nm",185,null,null,100183,"Tubular Motor SOLIDline Air 20Nm",185,null,null,"Not done","not translated yet","Not done",null,null,"Not done","not translated yet","Not done",null,"Not done","not translated yet","Not done",null,null,"Not done","not translated yet","Not done",null,null,"Not done","not translated yet","Not done",null,null,"Not done","not translated yet","Not done",null,null,"Not done","not translated yet","Not done",null,null,null,null,null,null,null,null,48,100183,100183,"not available in this country",100183,100183,100183,100183,100183,100183,100183,"Not done","Not done","Not done","Not done","Not done","Not done","Not done",null,null,null,null,"Geiger SOLIDline Air 20Nm","Tubular Motor SOLIDline Air 20Nm","not available in this country","Moteurr SOLIDline Air 20Nm","Motor persiana SOLIDline Air 20Nm","Trubkový Motor SOLIDline Air 20Nm","Geiger SOLIDline Air 20Nm","Geiger SOLIDline Air 20Nm","Trubkový Motor SOLIDline Air 20Nm","Tubular Motor SOLIDline Air 20Nm","not translated yet","not translated yet","not translated yet","not translated yet","not translated yet","not translated yet","not translated yet",null,null,null,null,null,185,145,0,185,185,4999,185,230.56,185,185,"Not done","Not done","Not done","Not done","Not done","Not done","Not done"]
[100184,"Geiger SOLIDline Air 50Nm",215,null,null,100184,"Tubular Motor SOLIDline Air 50Nm",170,null,null,"not available in this country","not available in this country",0,null,null,100184,"Moteur SOLIDline Air 50Nm",215,null,null,100184,"Motor persiana SOLIDline Air 50Nm",215,null,null,100184,"Trubkový Motor SOLIDline Air 50Nm",5799,null,null,100184,"Geiger SOLIDline Air 50Nm",215,null,null,100184,"Geiger SOLIDline Air 50Nm",267.56,null,null,100184,"Trubkový Motor SOLIDline Air 50Nm",215,null,null,100184,"Tubular Motor SOLIDline Air 50Nm",215,null,null,"Not done","not translated yet","Not done",null,null,"Not done","not translated yet","Not done",null,"Not done","not translated yet","Not done",null,null,"Not done","not translated yet","Not done",null,null,"Not done","not translated yet","Not done",null,null,"Not done","not translated yet","Not done",null,null,"Not done","not translated yet","Not done",null,null,null,null,null,null,null,null,49,100184,100184,"not available in this country",100184,100184,100184,100184,100184,100184,100184,"Not done","Not done","Not done","Not done","Not done","Not done","Not done",null,null,null,null,"Geiger SOLIDline Air 50Nm","Tubular Motor SOLIDline Air 50Nm","not available in this country","Moteur SOLIDline Air 50Nm","Motor persiana SOLIDline Air 50Nm","Trubkový Motor SOLIDline Air 50Nm","Geiger SOLIDline Air 50Nm","Geiger SOLIDline Air 50Nm","Trubkový Motor SOLIDline Air 50Nm","Tubular Motor SOLIDline Air 50Nm","not translated yet","not translated yet","not translated yet","not translated yet","not translated yet","not translated yet","not translated yet",null,null,null,null,null,215,170,0,215,215,5799,215,267.56,215,215,"Not done","Not done","Not done","Not done","Not done","Not done","Not done"]
[200001,"Netzteil 24V, 1,3A",35.86,null,null,200001,"24V Power Supply (1.3A)",32.5,null,null,200001,"24V Power Supply (1.3A)",49,null,null,200001,"Alimentation 24V (1.3A)",35.86,null,null,200001,"Fuente de alimentación 24V, 1,3A",35.86,null,null,200001,"24V Zdroj (1.3A)",908.26,null,null,200001,"Alimentatore 24V 1,3A",35.86,null,null,200001,"Netzteil 24V, 1,3A",46.25,null,null,200001,"24V Zdroj (1.3A)",35.86,null,null,200001,"24V Voeding (1.3A)",35.86,null,null,"Not done","not translated yet","Not done",null,null,"Not done","not translated yet","Not done",null,"Not done","not translated yet","Not done",null,null,"Not done","not translated yet","Not done",null,null,"Not done","not translated yet","Not done",null,null,"Not done","not translated yet","Not done",null,null,"Not done","not translated yet","Not done",null,null,null,null,null,null,null,null,50,200001,200001,200001,200001,200001,200001,200001,200001,200001,200001,"Not done","Not done","Not done","Not done","Not done","Not done","Not done",null,null,null,null,"Netzteil 24V, 1,3A","24V Power Supply (1.3A)","24V Power Supply (1.3A)","Alimentation 24V (1.3A)","Fuente de alimentación 24V, 1,3A","24V Zdroj (1.3A)","Alimentatore 24V 1,3A","Netzteil 24V, 1,3A","24V Zdroj (1.3A)","24V Voeding (1.3A)","not translated yet","not translated yet","not translated yet","not translated yet","not translated yet","not translated yet","not translated yet",null,null,null,null,null,35.86,32.5,49,35.86,35.86,908.26,35.86,46.25,35.86,35.86,"Not done","Not done","Not done","Not done","Not done","Not done","Not done"]
[200002,"Netzteil 24V, 4,2A",55.81,null,null,200002,"24V Power Supply (4.2A)",47.5,null,null,200002,"24V Power Supply (4.2A)",76,null,null,200002,"Alimentation 24V (4.2A)",55.81,null,null,200002,"Fuente de alimentación 24V, 4,2A",55.81,null,null,200002,"24V Zdroj (4.2A)",1404.13,null,null,200002,"Alimentatore 24V 4,2A",55.81,null,null,200002,"Netzteil 24V, 4,2A",71.25,null,null,200002,"24V Zdroj (4.2A)",55.81,null,null,200002,"24V Voeding (4.2A)",55.81,null,null,"Not done","not translated yet","Not done",null,null,"Not done","not translated yet","Not done",null,"Not done","not translated yet","Not done",null,null,"Not done","not translated yet","Not done",null,null,"Not done","not translated yet","Not done",null,null,"Not done","not translated yet","Not done",null,null,"Not done","not translated yet","Not done",null,null,null,null,null,null,null,null,51,200002,200002,200002,200002,200002,200002,200002,200002,200002,200002,"Not done","Not done","Not done","Not done","Not done","Not done","Not done",null,null,null,null,"Netzteil 24V, 4,2A","24V Power Supply (4.2A)","24V Power Supply (4.2A)","Alimentation 24V (4.2A)","Fuente de alimentación 24V, 4,2A","24V Zdroj (4.2A)","Alimentatore 24V 4,2A","Netzteil 24V, 4,2A","24V Zdroj (4.2A)","24V Voeding (4.2A)","not translated yet","not translated yet","not translated yet","not translated yet","not translated yet","not translated yet","not translated yet",null,null,null,null,null,55.81,47.5,76,55.81,55.81,1404.13,55.81,71.25,55.81,55.81,"Not done","Not done","Not done","Not done","Not done","Not done","Not done"]
[200003,"Temperaturfühler Außen",41.6,null,null,200003,"Outside Temperature Sensor 0-10V",37.5,null,null,200003,"Outside Temperature Sensor 0-10V",59,null,null,200003,"Sonde de température Extérieur 0-10V",41.6,null,null,200003,"Sensor de temperatura para exterior",41.6,null,null,200003,"Venkovní senzor teploty",1032.23,null,null,200003,"Sensore temperatura esterno 0-10V",41.6,null,null,200003,"Temperaturfühler Außen",49.95,null,null,200003,"Vonkajší teplotný senzor",41.6,null,null,200003,"Buitentemperatuur voeler 0-10V",41.6,null,null,"Not done","not translated yet","Not done",null,null,"Not done","not translated yet","Not done",null,"Not done","not translated yet","Not done",null,null,"Not done","not translated yet","Not done",null,null,"Not done","not translated yet","Not done",null,null,"Not done","not translated yet","Not done",null,null,"Not done","not translated yet","Not done",null,null,null,null,null,null,null,null,52,200003,200003,200003,200003,200003,200003,200003,200003,200003,200003,"Not done","Not done","Not done","Not done","Not done","Not done","Not done",null,null,null,null,"Temperaturfühler Außen","Outside Temperature Sensor 0-10V","Outside Temperature Sensor 0-10V","Sonde de température Extérieur 0-10V","Sensor de temperatura para exterior","Venkovní senzor teploty","Sensore temperatura esterno 0-10V","Temperaturfühler Außen","Vonkajší teplotný senzor","Buitentemperatuur voeler 0-10V","not translated yet","not translated yet","not translated yet","not translated yet","not translated yet","not translated yet","not translated yet",null,null,null,null,null,41.6,37.5,59,41.6,41.6,1032.23,41.6,49.95,41.6,41.6,"Not done","Not done","Not done","Not done","Not done","Not done","Not done"]
[0,"No longer sold",0,null,null,0,"No longer sold",0,null,null,0,"No longer sold",0,null,null,0,"No longer sold",0,null,null,0,"No longer sold",0,null,null,0,"No longer sold",0,null,null,0,"No longer sold",0,null,null,0,"No longer sold",0,null,null,0,"No longer sold",0,null,null,0,"No longer sold",0,null,null,"Not done","not translated yet","Not done",null,null,"Not done","not translated yet","Not done",null,"Not done","not translated yet","Not done",null,null,"Not done","not translated yet","Not done",null,null,"Not done","not translated yet","Not done",null,null,"Not done","not translated yet","Not done",null,null,"Not done","not translated yet","Not done",null,null,null,null,null,null,null,null,53,0,0,0,0,0,0,0,0,0,0,"Not done","Not done","Not done","Not done","Not done","Not done","Not done",null,null,null,null,"No longer sold","No longer sold","No longer sold","No longer sold","No longer sold","No longer sold","No longer sold","No longer sold","No longer sold","No longer sold","not translated yet","not translated yet","not translated yet","not translated yet","not translated yet","not translated yet","not translated yet",null,null,null,null,null,0,0,0,0,0,0,0,0,0,0,"Not done","Not done","Not done","Not done","Not done","Not done","Not done"]
[0,"No longer sold",0,null,null,0,"No longer sold",0,null,null,0,"No longer sold",0,null,null,0,"No longer sold",0,null,null,0,"No longer sold",0,null,null,0,"No longer sold",0,null,null,0,"No longer sold",0,null,null,0,"No longer sold",0,null,null,0,"No longer sold",0,null,null,0,"No longer sold",0,null,null,"Not done","not translated yet","Not done",null,null,"Not done","not translated yet","Not done",null,"Not done","not translated yet","Not done",null,null,"Not done","not translated yet","Not done",null,null,"Not done","not translated yet","Not done",null,null,"Not done","not translated yet","Not done",null,null,"Not done","not translated yet","Not done",null,null,null,null,null,null,null,null,54,0,0,0,0,0,0,0,0,0,0,"Not done","Not done","Not done","Not done","Not done","Not done","Not done",null,null,null,null,"No longer sold","No longer sold","No longer sold","No longer sold","No longer sold","No longer sold","No longer sold","No longer sold","No longer sold","No longer sold","not translated yet","not translated yet","not translated yet","not translated yet","not translated yet","not translated yet","not translated yet",null,null,null,null,null,0,0,0,0,0,0,0,0,0,0,"Not done","Not done","Not done","Not done","Not done","Not done","Not done"]
[200006,"Temperaturfühler Wohnraum",41.6,null,null,200006,"Indoor Temperature Sensor 0-10V",37.5,null,null,200006,"Indoor Temperature Sensor 0-10V",59,null,null,200006,"Sonde de température intérieur 0-10V",41.6,null,null,200006,"Sensor de temperatura para interior 0-10V",41.6,null,null,200006,"Vnitřní teplotní senzor 0-10V",1032.23,null,null,200006,"Sensore temperatura interno 0-10V",41.6,null,null,200006,"Temperaturfühler Wohnraum",53.66,null,null,200006,"Vnitřní teplotní senzor 0-10V",41.6,null,null,200006,"Binnentemperatuur voeler 0-10V",41.6,null,null,"Not done","not translated yet","Not done",null,null,"Not done","not translated yet","Not done",null,"Not done","not translated yet","Not done",null,null,"Not done","not translated yet","Not done",null,null,"Not done","not translated yet","Not done",null,null,"Not done","not translated yet","Not done",null,null,"Not done","not translated yet","Not done",null,null,null,null,null,null,null,null,55,200006,200006,200006,200006,200006,200006,200006,200006,200006,200006,"Not done","Not done","Not done","Not done","Not done","Not done","Not done",null,null,null,null,"Temperaturfühler Wohnraum","Indoor Temperature Sensor 0-10V","Indoor Temperature Sensor 0-10V","Sonde de température intérieur 0-10V","Sensor de temperatura para interior 0-10V","Vnitřní teplotní senzor 0-10V","Sensore temperatura interno 0-10V","Temperaturfühler Wohnraum","Vnitřní teplotní senzor 0-10V","Binnentemperatuur voeler 0-10V","not translated yet","not translated yet","not translated yet","not translated yet","not translated yet","not translated yet","not translated yet",null,null,null,null,null,41.6,37.5,59,41.6,41.6,1032.23,41.6,53.66,41.6,41.6,"Not done","Not done","Not done","Not done","Not done","Not done","Not done"]
[200007,"Wireless-G Router",24.92,null,null,"NA","not available in this country",0,null,null,"not available in this country","not available in this country",0,null,null,200007,"Routeur Wifi - Netgear",24.92,null,null,200007,"Wireless-G Router",24.92,null,null,"not available in this country","not available in this country",0,null,null,200007,"Wireless-G Router",24.92,null,null,200007,"Wireless-G Router",33.29,null,null,"not available in this country","not available in this country",0,null,null,200007,"Wireless-N Router",24.92,null,null,"Not done","not translated yet","Not done",null,null,"Not done","not translated yet","Not done",null,"Not done","not translated yet","Not done",null,null,"Not done","not translated yet","Not done",null,null,"Not done","not translated yet","Not done",null,null,"Not done","not translated yet","Not done",null,null,"Not done","not translated yet","Not done",null,null,null,null,null,null,null,null,56,200007,"NA","not available in this country",200007,200007,"not available in this country",200007,200007,"not available in this country",200007,"Not done","Not done","Not done","Not done","Not done","Not done","Not done",null,null,null,null,"Wireless-G Router","not available in this country","not available in this country","Routeur Wifi - Netgear","Wireless-G Router","not available in this country","Wireless-G Router","Wireless-G Router","not available in this country","Wireless-N Router","not translated yet","not translated yet","not translated yet","not translated yet","not translated yet","not translated yet","not translated yet",null,null,null,null,null,24.92,0,0,24.92,24.92,0,24.92,33.29,0,24.92,"Not done","Not done","Not done","Not done","Not done","Not done","Not done"]
[200010,"Temperatur/Feuchte Wohnraum",87.4,null,null,200010,"Indoor Temperature & Humidity Sensor 0-10V",77.5,null,null,200010,"Indoor Temperature & Humidity Sensor 0-10V",119,null,null,200010,"Sonde de Temp & Hum intérieur 0-10V",87.4,null,null,200010,"Sensor de temperatura y humedad para interior 0-10V",87.4,null,null,200010,"Senzor teploty a vlhkosti (vnitřní) 0-10V",2189.2600000000002,null,null,200010,"Temperatura/umidità interno 0-10V",87.4,null,null,200010,"Temperatur/Feuchte Wohnraum",100.93,null,null,200010,"Senzor teploty a vlhkosti (vnitřní) 0-10V",87.4,null,null,200010,"Binnentemperatuur & Vochtigheid Voeler Sensor 0-10V",87.4,null,null,"Not done","not translated yet","Not done",null,null,"Not done","not translated yet","Not done",null,"Not done","not translated yet","Not done",null,null,"Not done","not translated yet","Not done",null,null,"Not done","not translated yet","Not done",null,null,"Not done","not translated yet","Not done",null,null,"Not done","not translated yet","Not done",null,null,null,null,null,null,null,null,57,200010,200010,200010,200010,200010,200010,200010,200010,200010,200010,"Not done","Not done","Not done","Not done","Not done","Not done","Not done",null,null,null,null,"Temperatur/Feuchte Wohnraum","Indoor Temperature & Humidity Sensor 0-10V","Indoor Temperature & Humidity Sensor 0-10V","Sonde de Temp & Hum intérieur 0-10V","Sensor de temperatura y humedad para interior 0-10V","Senzor teploty a vlhkosti (vnitřní) 0-10V","Temperatura/umidità interno 0-10V","Temperatur/Feuchte Wohnraum","Senzor teploty a vlhkosti (vnitřní) 0-10V","Binnentemperatuur & Vochtigheid Voeler Sensor 0-10V","not translated yet","not translated yet","not translated yet","not translated yet","not translated yet","not translated yet","not translated yet",null,null,null,null,null,87.4,77.5,119,87.4,87.4,2189.2600000000002,87.4,100.93,87.4,87.4,"Not done","Not done","Not done","Not done","Not done","Not done","Not done"]
[200012,"Ventiladapter VA80",1.19,null,null,200012,"Valve Adaptor VA80",1,null,null,200012,"Valve Adaptor VA80",2,null,null,200012,"Adaptateur vanne VA80",1.19,null,null,200012,"Adaptador para válvula VA80",1.19,null,null,200012,"Adaptér ventilu VA80",29.75,null,null,200012,"Adattore valvola VA80",1.19,null,null,200012,"Ventiladapter VA80",1.62,null,null,200012,"Adaptér ventilu VA80",1.19,null,null,200012,"Ventieladapter VA80",1.19,null,null,"Not done","not translated yet","Not done",null,null,"Not done","not translated yet","Not done",null,"Not done","not translated yet","Not done",null,null,"Not done","not translated yet","Not done",null,null,"Not done","not translated yet","Not done",null,null,"Not done","not translated yet","Not done",null,null,"Not done","not translated yet","Not done",null,null,null,null,null,null,null,null,58,200012,200012,200012,200012,200012,200012,200012,200012,200012,200012,"Not done","Not done","Not done","Not done","Not done","Not done","Not done",null,null,null,null,"Ventiladapter VA80","Valve Adaptor VA80","Valve Adaptor VA80","Adaptateur vanne VA80","Adaptador para válvula VA80","Adaptér ventilu VA80","Adattore valvola VA80","Ventiladapter VA80","Adaptér ventilu VA80","Ventieladapter VA80","not translated yet","not translated yet","not translated yet","not translated yet","not translated yet","not translated yet","not translated yet",null,null,null,null,null,1.19,1,2,1.19,1.19,29.75,1.19,1.62,1.19,1.19,"Not done","Not done","Not done","Not done","Not done","Not done","Not done"]
[200013,"Micro-SD Karte",6.4,null,null,"NA","not available in this country",0,null,null,"not available in this country","not available in this country",0,null,null,"not available in this country","not available in this country",null,null,null,200013,"Tarjeta Micro-SD",6.4,null,null,"not available in this country","not available in this country",0,null,null,200013,"Scheda micro SD",6.4,null,null,40,"Micro-SD Karte",6.71,null,null,"not available in this country","not available in this country",0,null,null,200013,"Micro SD Kaart",6.4,null,null,"Not done","not translated yet","Not done",null,null,"Not done","not translated yet","Not done",null,"Not done","not translated yet","Not done",null,null,"Not done","not translated yet","Not done",null,null,"Not done","not translated yet","Not done",null,null,"Not done","not translated yet","Not done",null,null,"Not done","not translated yet","Not done",null,null,null,null,null,null,null,null,59,200013,"NA","not available in this country","not available in this country",200013,"not available in this country",200013,40,"not available in this country",200013,"Not done","Not done","Not done","Not done","Not done","Not done","Not done",null,null,null,null,"Micro-SD Karte","not available in this country","not available in this country","not available in this country","Tarjeta Micro-SD","not available in this country","Scheda micro SD","Micro-SD Karte","not available in this country","Micro SD Kaart","not translated yet","not translated yet","not translated yet","not translated yet","not translated yet","not translated yet","not translated yet",null,null,null,null,null,6.4,0,0,0,6.4,0,6.4,6.71,0,6.4,"Not done","Not done","Not done","Not done","Not done","Not done","Not done"]
[200017,"Temperatur/Feuchte/ CO2",229.9,null,null,200017,"Indoor Temperature, Humidty & CO2 Sensor 0-10V",197.5,null,null,200017,"Indoor Temperature, Humidty & CO2 Sensor 0-10V",314,null,null,200017,"Capteur Temp / hum / CO2 intérieur 0-10V",229.9,null,null,200017,"Sensor CO2, temperatura y humedad",229.9,null,null,200017,"Senzor CO2/Teplota/Vlhkost",5784.3,null,null,200017,"Temperatura/umidità/CO2",229.9,null,null,200017,"Temperatur/Feuchte/ CO2",286.11,null,null,200017,"Senzor CO2/Teplota/Vlhkost",229.9,null,null,200017,"Binnentemperatuur/Vochtigheid/CO2 Voeler 0-10V",229.9,null,null,"Not done","not translated yet","Not done",null,null,"Not done","not translated yet","Not done",null,"Not done","not translated yet","Not done",null,null,"Not done","not translated yet","Not done",null,null,"Not done","not translated yet","Not done",null,null,"Not done","not translated yet","Not done",null,null,"Not done","not translated yet","Not done",null,null,null,null,null,null,null,null,60,200017,200017,200017,200017,200017,200017,200017,200017,200017,200017,"Not done","Not done","Not done","Not done","Not done","Not done","Not done",null,null,null,null,"Temperatur/Feuchte/ CO2","Indoor Temperature, Humidty & CO2 Sensor 0-10V","Indoor Temperature, Humidty & CO2 Sensor 0-10V","Capteur Temp / hum / CO2 intérieur 0-10V","Sensor CO2, temperatura y humedad","Senzor CO2/Teplota/Vlhkost","Temperatura/umidità/CO2","Temperatur/Feuchte/ CO2","Senzor CO2/Teplota/Vlhkost","Binnentemperatuur/Vochtigheid/CO2 Voeler 0-10V","not translated yet","not translated yet","not translated yet","not translated yet","not translated yet","not translated yet","not translated yet",null,null,null,null,null,229.9,197.5,314,229.9,229.9,5784.3,229.9,286.11,229.9,229.9,"Not done","Not done","Not done","Not done","Not done","Not done","Not done"]
[200018,"Regensensor 24V",57.9,null,null,200018,"Rain Sensor (24V)",55,null,null,200018,"Rain Sensor (24V)",79,null,null,200018,"Capteur de pluie 24V",57.9,null,null,200018,"Sensor de lluvia 24V",57.9,null,null,200018,"Dešťový senzor (24V)",1445.45,null,null,200018,"Sensore pioggia 24V",57.9,null,null,200018,"Regensensor 24V",74.03,null,null,200018,"Dešťový senzor (24V)",57.9,null,null,200018,"RegenSensor (24V)",57.9,null,null,"Not done","not translated yet","Not done",null,null,"Not done","not translated yet","Not done",null,"Not done","not translated yet","Not done",null,null,"Not done","not translated yet","Not done",null,null,"Not done","not translated yet","Not done",null,null,"Not done","not translated yet","Not done",null,null,"Not done","not translated yet","Not done",null,null,null,null,null,null,null,null,61,200018,200018,200018,200018,200018,200018,200018,200018,200018,200018,"Not done","Not done","Not done","Not done","Not done","Not done","Not done",null,null,null,null,"Regensensor 24V","Rain Sensor (24V)","Rain Sensor (24V)","Capteur de pluie 24V","Sensor de lluvia 24V","Dešťový senzor (24V)","Sensore pioggia 24V","Regensensor 24V","Dešťový senzor (24V)","RegenSensor (24V)","not translated yet","not translated yet","not translated yet","not translated yet","not translated yet","not translated yet","not translated yet",null,null,null,null,null,57.9,55,79,57.9,57.9,1445.45,57.9,74.03,57.9,57.9,"Not done","Not done","Not done","Not done","Not done","Not done","Not done"]
[200031,"Temperatur/Feuchte Außen",116.9,null,null,200031,"Outdoor Temperature & Humidy Sensor 0-10V",103.75,null,null,200031,"Outdoor Temperature & Humidy Sensor 0-10V",159,null,null,200031,"Sonde Temp & Hum Exterieur",116.9,null,null,200031,"Sensor de temperatura y humedad exterior 0-10V",116.9,null,null,200031,"Senzor teploty a vlhkosti (venkovní)",2933.06,null,null,200031,"Temperatura/umidità esterno",116.9,null,null,200031,"Temperatur/Feuchte Außen",147.22,null,null,200031,"Senzor teploty a vlhkosti (venkovní)",116.9,null,null,200031,"Buitentemperatuur & Vochtigheidsvoeler",116.9,null,null,"Not done","not translated yet","Not done",null,null,"Not done","not translated yet","Not done",null,"Not done","not translated yet","Not done",null,null,"Not done","not translated yet","Not done",null,null,"Not done","not translated yet","Not done",null,null,"Not done","not translated yet","Not done",null,null,"Not done","not translated yet","Not done",null,null,null,null,null,null,null,null,62,200031,200031,200031,200031,200031,200031,200031,200031,200031,200031,"Not done","Not done","Not done","Not done","Not done","Not done","Not done",null,null,null,null,"Temperatur/Feuchte Außen","Outdoor Temperature & Humidy Sensor 0-10V","Outdoor Temperature & Humidy Sensor 0-10V","Sonde Temp & Hum Exterieur","Sensor de temperatura y humedad exterior 0-10V","Senzor teploty a vlhkosti (venkovní)","Temperatura/umidità esterno","Temperatur/Feuchte Außen","Senzor teploty a vlhkosti (venkovní)","Buitentemperatuur & Vochtigheidsvoeler","not translated yet","not translated yet","not translated yet","not translated yet","not translated yet","not translated yet","not translated yet",null,null,null,null,null,116.9,103.75,159,116.9,116.9,2933.06,116.9,147.22,116.9,116.9,"Not done","Not done","Not done","Not done","Not done","Not done","Not done"]
[200032,"Helligkeitssensor 0-10V",79.900000000000006,null,null,200032,"Brightness Sensor 0-10V",70,null,null,200032,"Brightness Sensor 0-10V",109,null,null,200032,"Capteur de luminosité 24V",79.900000000000006,null,null,200032,"Sensor de luminosidad 0-10V",79.900000000000006,null,null,200032,"Senzor osvětlení 0-10V",1982.64,null,null,200032,"Sensore di luminosità 0-10V",79.900000000000006,null,null,200032,"Helligkeitssensor 0-10V",100.93,null,null,200032,"Senzor osvětlení 0-10V",79.900000000000006,null,null,200032,"Helderheid Sensor 0-10V",79.900000000000006,null,null,"Not done","not translated yet","Not done",null,null,"Not done","not translated yet","Not done",null,"Not done","not translated yet","Not done",null,null,"Not done","not translated yet","Not done",null,null,"Not done","not translated yet","Not done",null,null,"Not done","not translated yet","Not done",null,null,"Not done","not translated yet","Not done",null,null,null,null,null,null,null,null,63,200032,200032,200032,200032,200032,200032,200032,200032,200032,200032,"Not done","Not done","Not done","Not done","Not done","Not done","Not done",null,null,null,null,"Helligkeitssensor 0-10V","Brightness Sensor 0-10V","Brightness Sensor 0-10V","Capteur de luminosité 24V","Sensor de luminosidad 0-10V","Senzor osvětlení 0-10V","Sensore di luminosità 0-10V","Helligkeitssensor 0-10V","Senzor osvětlení 0-10V","Helderheid Sensor 0-10V","not translated yet","not translated yet","not translated yet","not translated yet","not translated yet","not translated yet","not translated yet",null,null,null,null,null,79.900000000000006,70,109,79.900000000000006,79.900000000000006,1982.64,79.900000000000006,100.93,79.900000000000006,79.900000000000006,"Not done","Not done","Not done","Not done","Not done","Not done","Not done"]
[200033,"Windsensor 24V",73.2,null,null,200033,"Wind Sensor (24V)",66.25,null,null,200033,"Wind Sensor (24V)",99,null,null,200033,"Anémomètre 24V",73.2,null,null,200033,"Anemómetro 24V",73.2,null,null,200033,"Senzor větru (24V)",1817.36,null,null,200033,"Sensore del vento 24V",73.2,null,null,200033,"Windsensor 24V",89.77,null,null,200033,"Senzor větru (24V)",73.2,null,null,200033,"Wind Sensor (24V)",73.2,null,null,"Not done","not translated yet","Not done",null,null,"Not done","not translated yet","Not done",null,"Not done","not translated yet","Not done",null,null,"Not done","not translated yet","Not done",null,null,"Not done","not translated yet","Not done",null,null,"Not done","not translated yet","Not done",null,null,"Not done","not translated yet","Not done",null,null,null,null,null,null,null,null,64,200033,200033,200033,200033,200033,200033,200033,200033,200033,200033,"Not done","Not done","Not done","Not done","Not done","Not done","Not done",null,null,null,null,"Windsensor 24V","Wind Sensor (24V)","Wind Sensor (24V)","Anémomètre 24V","Anemómetro 24V","Senzor větru (24V)","Sensore del vento 24V","Windsensor 24V","Senzor větru (24V)","Wind Sensor (24V)","not translated yet","not translated yet","not translated yet","not translated yet","not translated yet","not translated yet","not translated yet",null,null,null,null,null,73.2,66.25,99,73.2,73.2,1817.36,73.2,89.77,73.2,73.2,"Not done","Not done","Not done","Not done","Not done","Not done","Not done"]
[200034,"Halterung für Windsensor",55,null,null,200034,"Wind Sensor Mount",47.5,null,null,200034,"Wind Sensor Mount",75,null,null,200034,"Socle anémomètre",55,null,null,200034,"Soporte para sensor de viento",55,null,null,200034,"Držák pro senzor větru",1362.81,null,null,200034,"Supporto per sensore del vento",55,null,null,200034,"Halterung für Windsensor",70.319999999999993,null,null,200034,"Držák pro senzor větru",55,null,null,200034,"Wind Sensor Muurbevestiging",55,null,null,"Not done","not translated yet","Not done",null,null,"Not done","not translated yet","Not done",null,"Not done","not translated yet","Not done",null,null,"Not done","not translated yet","Not done",null,null,"Not done","not translated yet","Not done",null,null,"Not done","not translated yet","Not done",null,null,"Not done","not translated yet","Not done",null,null,null,null,null,null,null,null,65,200034,{"$f":"F68","v":200034},200034,200034,200034,200034,200034,200034,200034,200034,"Not done","Not done","Not done","Not done","Not done","Not done","Not done",null,null,null,null,"Halterung für Windsensor","Wind Sensor Mount","Wind Sensor Mount","Socle anémomètre","Soporte para sensor de viento","Držák pro senzor větru","Supporto per sensore del vento","Halterung für Windsensor","Držák pro senzor větru","Wind Sensor Muurbevestiging","not translated yet","not translated yet","not translated yet","not translated yet","not translated yet","not translated yet","not translated yet",null,null,null,null,null,55,47.5,75,55,55,1362.81,55,70.319999999999993,55,55,"Not done","Not done","Not done","Not done","Not done","Not done","Not done"]
[200035,"Netzteil 24V, 10A",129.9,null,null,200035,"24V Power Supply (10A)",112.5,null,null,200035,"24V Power Supply (10A)",179,null,null,200035,"Alimentation 24V 10A",129.9,null,null,200035,"Fuente de alimentación 24V, 10A",129.9,null,null,200035,"24V Zdroj (10A)",3304.96,null,null,200035,"Alimentatore 24V 10A",129.9,null,null,200035,"Netzteil 24V, 10A",165.74,null,null,200035,"24V Zdroj (10A)",129.9,null,null,200035,"24V Voeding (10A)",129.9,null,null,"Not done","not translated yet","Not done",null,null,"Not done","not translated yet","Not done",null,"Not done","not translated yet","Not done",null,null,"Not done","not translated yet","Not done",null,null,"Not done","not translated yet","Not done",null,null,"Not done","not translated yet","Not done",null,null,"Not done","not translated yet","Not done",null,null,null,null,null,null,null,null,66,{"$f":"A69","v":200035},200035,{"$f":"K69","v":200035},{"$f":"P69","v":200035},{"$f":"U69","v":200035},{"$f":"Z69","v":200035},{"$f":"AE69","v":200035},{"$f":"AJ69","v":200035},{"$f":"AO69","v":200035},{"$f":"AT69","v":200035},{"$f":"AY69","v":"Not done"},{"$f":"BD69","v":"Not done"},{"$f":"BH69","v":"Not done"},{"$f":"BM69","v":"Not done"},{"$f":"BR69","v":"Not done"},{"$f":"BW69","v":"Not done"},{"$f":"CB69","v":"Not done"},null,null,null,null,{"$f":"B69","v":"Netzteil 24V, 10A"},{"$f":"G69","v":"24V Power Supply (10A)"},{"$f":"L69","v":"24V Power Supply (10A)"},{"$f":"Q69","v":"Alimentation 24V 10A"},{"$f":"V69","v":"Fuente de alimentación 24V, 10A"},{"$f":"AA69","v":"24V Zdroj (10A)"},{"$f":"AF69","v":"Alimentatore 24V 10A"},{"$f":"AK69","v":"Netzteil 24V, 10A"},{"$f":"AP69","v":"24V Zdroj (10A)"},{"$f":"AU69","v":"24V Voeding (10A)"},{"$f":"AZ69","v":"not translated yet"},{"$f":"BE69","v":"not translated yet"},{"$f":"BI69","v":"not translated yet"},{"$f":"BN69","v":"not translated yet"},{"$f":"BS69","v":"not translated yet"},{"$f":"BX69","v":"not translated yet"},{"$f":"CC69","v":"not translated yet"},null,null,null,null,null,{"$f":"C69","v":129.9},{"$f":"H69","v":112.5},{"$f":"M69","v":179},{"$f":"R69","v":129.9},{"$f":"W69","v":129.9},{"$f":"AB69","v":3304.96},{"$f":"AG69","v":129.9},{"$f":"AL69","v":165.74},{"$f":"AQ69","v":129.9},{"$f":"AV69","v":129.9},{"$f":"BA69","v":"Not done"},{"$f":"BF69","v":"Not done"},{"$f":"BJ69","v":"Not done"},{"$f":"BO69","v":"Not done"},{"$f":"BT69","v":"Not done"},{"$f":"BY69","v":"Not done"},{"$f":"CD69","v":"Not done"}]
[200039,"Präsenzmelder 24V",104.9,null,null,200039,"Presence Sensor (24V)",93.75,null,null,"not available in this country","not available in this country",0,null,null,200039,"Détecteur de mouvement 24V",104.9,null,null,200039,"Detector de presencia para interior 24V",104.9,null,null,200039,"Senzor přítomnosti (24V) vnitřní",2799,null,null,200039,"Sensore di presenza 24V",104.9,null,null,200039,"Präsenzmelder 24V",128.69999999999999,null,null,200039,"Senzor přítomnosti (24V) vnitřní",104.9,null,null,200039,"Aanwezigheidsmelder (24V)",104.9,null,null,"Not done","not translated yet","Not done",null,null,"Not done","not translated yet","Not done",null,"Not done","not translated yet","Not done",null,null,"Not done","not translated yet","Not done",null,null,"Not done","not translated yet","Not done",null,null,"Not done","not translated yet","Not done",null,null,"Not done","not translated yet","Not done",null,null,null,null,null,null,null,null,67,200039,200039,"not available in this country",200039,200039,200039,200039,200039,200039,200039,"Not done","Not done","Not done","Not done","Not done","Not done","Not done",null,null,null,null,"Präsenzmelder 24V","Presence Sensor (24V)","not available in this country","Détecteur de mouvement 24V","Detector de presencia para interior 24V","Senzor přítomnosti (24V) vnitřní","Sensore di presenza 24V","Präsenzmelder 24V","Senzor přítomnosti (24V) vnitřní","Aanwezigheidsmelder (24V)","not translated yet","not translated yet","not translated yet","not translated yet","not translated yet","not translated yet","not translated yet",null,null,null,null,null,104.9,93.75,0,104.9,104.9,2799,104.9,128.69999999999999,104.9,104.9,"Not done","Not done","Not done","Not done","Not done","Not done","Not done"]
[200040,"Aufputzdose IP 20 weiß",6.9,null,null,200040,"Surface Mount Box - IP20",6.25,null,null,200040,"Surface Mount Box - IP20",10,null,null,200040,"Surface Mount Box - IP20",6.9,null,null,200040,"Caja para montaje superficial IP 20 blanca",6.9,null,null,200040,"Instalační krabice IP20 bílá",229,null,null,200040,"Scatola sporgente IP 20 bianco",6.9,null,null,"not available in this country","not available in this country",0,null,null,200040,"Instalační krabice IP20 bílá",6.9,null,null,200040,"Opbouwdoos - IP20 - Wit",6.9,null,null,"Not done","not translated yet","Not done",null,null,"Not done","not translated yet","Not done",null,"Not done","not translated yet","Not done",null,null,"Not done","not translated yet","Not done",null,null,"Not done","not translated yet","Not done",null,null,"Not done","not translated yet","Not done",null,null,"Not done","not translated yet","Not done",null,null,null,null,null,null,null,null,68,200040,200040,200040,200040,200040,200040,200040,"not available in this country",200040,200040,"Not done","Not done","Not done","Not done","Not done","Not done","Not done",null,null,null,null,"Aufputzdose IP 20 weiß","Surface Mount Box - IP20","Surface Mount Box - IP20","Surface Mount Box - IP20","Caja para montaje superficial IP 20 blanca","Instalační krabice IP20 bílá","Scatola sporgente IP 20 bianco","not available in this country","Instalační krabice IP20 bílá","Opbouwdoos - IP20 - Wit","not translated yet","not translated yet","not translated yet","not translated yet","not translated yet","not translated yet","not translated yet",null,null,null,null,null,6.9,6.25,10,6.9,6.9,229,6.9,0,6.9,6.9,"Not done","Not done","Not done","Not done","Not done","Not done","Not done"]
[200042,"RGB LED Streifen 5m IP20",79.900000000000006,null,null,200042,"RGB LED Strip 5m",72.5,null,null,200042,"RGB LED Strip 5m",109,null,null,200042,"Ruban Led RGB 5m IP20",79.900000000000006,null,null,200042,"Tira LED RGB 5m IP20",79.900000000000006,null,null,200042,"5m RGB LED pásky IP20 (bez ochrany proti vodě)",2149,null,null,200042,"RGB strisce LED 5m IP20",79.900000000000006,null,null,200042,"RGB LED Streifen 5m IP20",70.650000000000006,null,null,200042,"5m RGB LED pásky IP20 (bez ochrany proti vodě)",79.900000000000006,null,null,200042,"RGB LED Strip 5m",79.900000000000006,null,null,"Not done","not translated yet","Not done",null,null,"Not done","not translated yet","Not done",null,"Not done","not translated yet","Not done",null,null,"Not done","not translated yet","Not done",null,null,"Not done","not translated yet","Not done",null,null,"Not done","not translated yet","Not done",null,null,"Not done","not translated yet","Not done",null,null,null,null,null,null,null,null,69,200042,200042,200042,200042,200042,200042,200042,200042,200042,200042,"Not done","Not done","Not done","Not done","Not done","Not done","Not done",null,null,null,null,"RGB LED Streifen 5m IP20","RGB LED Strip 5m","RGB LED Strip 5m","Ruban Led RGB 5m IP20","Tira LED RGB 5m IP20","5m RGB LED pásky IP20 (bez ochrany proti vodě)","RGB strisce LED 5m IP20","RGB LED Streifen 5m IP20","5m RGB LED pásky IP20 (bez ochrany proti vodě)","RGB LED Strip 5m","not translated yet","not translated yet","not translated yet","not translated yet","not translated yet","not translated yet","not translated yet",null,null,null,null,null,79.900000000000006,72.5,109,79.900000000000006,79.900000000000006,2149,79.900000000000006,70.650000000000006,79.900000000000006,79.900000000000006,"Not done","Not done","Not done","Not done","Not done","Not done","Not done"]
[200043,"LED Streifen Warmweiß IP20",79.900000000000006,null,null,200043,"Warm White LED Strip 5m",72.5,null,null,200043,"Warm White LED Strip 5m",109,null,null,200043,"Ruban Blanc Chaud 5m IP20",79.900000000000006,null,null,200043,"Tira LED blanco cálido IP20",79.900000000000006,null,null,200043,"5m LED pásky (teplá bílá) - IP20 (bez ochrany proti vodě)",2149,null,null,200043,"Strisce LED bianco caldo IP20",79.900000000000006,null,null,200043,"LED Streifen Warmweiß IP20",100.93,null,null,200043,"5m LED pásky (teplá bílá) - IP20 (bez ochrany proti vodě)",79.900000000000006,null,null,200043,"Warm Wit LED Strip 5m",79.900000000000006,null,null,"Not done","not translated yet","Not done",null,null,"Not done","not translated yet","Not done",null,"Not done","not translated yet","Not done",null,null,"Not done","not translated yet","Not done",null,null,"Not done","not translated yet","Not done",null,null,"Not done","not translated yet","Not done",null,null,"Not done","not translated yet","Not done",null,null,null,null,null,null,null,null,70,200043,200043,200043,200043,200043,200043,200043,200043,200043,200043,"Not done","Not done","Not done","Not done","Not done","Not done","Not done",null,null,null,null,"LED Streifen Warmweiß IP20","Warm White LED Strip 5m","Warm White LED Strip 5m","Ruban Blanc Chaud 5m IP20","Tira LED blanco cálido IP20","5m LED pásky (teplá bílá) - IP20 (bez ochrany proti vodě)","Strisce LED bianco caldo IP20","LED Streifen Warmweiß IP20","5m LED pásky (teplá bílá) - IP20 (bez ochrany proti vodě)","Warm Wit LED Strip 5m","not translated yet","not translated yet","not translated yet","not translated yet","not translated yet","not translated yet","not translated yet",null,null,null,null,null,79.900000000000006,72.5,109,79.900000000000006,79.900000000000006,2149,79.900000000000006,100.93,79.900000000000006,79.900000000000006,"Not done","Not done","Not done","Not done","Not done","Not done","Not done"]
[200045,"RGB LED Str. 5m IP65",84.9,null,null,200045,"RGB LED Strip 5m IP65",75,null,null,200045,"RGB LED Strip 5m IP65",122,null,null,200045,"Ruban Led RGB 5m IP65",84.9,null,null,200045,"Tira LED RGB 5m IP65",84.9,null,null,"not available in this country","not available in this country",0,null,null,200045,"RGB strisce LED 5m IP65",84.9,null,null,"not available in this country","not available in this country",0,null,null,"not available in this country","not available in this country",0,null,null,200045,"RGB LED Strip 5m IP65",84.9,null,null,"Not done","not translated yet","Not done",null,null,"Not done","not translated yet","Not done",null,"Not done","not translated yet","Not done",null,null,"Not done","not translated yet","Not done",null,null,"Not done","not translated yet","Not done",null,null,"Not done","not translated yet","Not done",null,null,"Not done","not translated yet","Not done",null,null,null,null,null,null,null,null,71,200045,200045,200045,200045,200045,"not available in this country",200045,"not available in this country","not available in this country",200045,"Not done","Not done","Not done","Not done","Not done","Not done","Not done",null,null,null,null,"RGB LED Str. 5m IP65","RGB LED Strip 5m IP65","RGB LED Strip 5m IP65","Ruban Led RGB 5m IP65","Tira LED RGB 5m IP65","not available in this country","RGB strisce LED 5m IP65","not available in this country","not available in this country","RGB LED Strip 5m IP65","not translated yet","not translated yet","not translated yet","not translated yet","not translated yet","not translated yet","not translated yet",null,null,null,null,null,84.9,75,122,84.9,84.9,0,84.9,0,0,84.9,"Not done","Not done","Not done","Not done","Not done","Not done","Not done"]
[200046,"RGB LED Streifen 5m IP68",89.9,null,null,200046,"RGB LED Strip 5m IP68",77.5,null,null,200046,"RGB LED Strip 5m IP68",122,null,null,200046,"Ruban led RGB 5m IP68",89.9,null,null,200046,"Tira LED RGB 5m IP68",89.9,null,null,200046,"5m RGB LED pásky IP68 (proti potopení do vody)",2499,null,null,200046,"RGB strisce LED 5m IP68",89.9,null,null,200046,"RGB LED Streifen 5m IP68",83.61,null,null,200046,"5m RGB LED pásky IP68 (proti potopení do vody)",89.9,null,null,200046,"RGB LED Strip 5m IP68",89.9,null,null,"Not done","not translated yet","Not done",null,null,"Not done","not translated yet","Not done",null,"Not done","not translated yet","Not done",null,null,"Not done","not translated yet","Not done",null,null,"Not done","not translated yet","Not done",null,null,"Not done","not translated yet","Not done",null,null,"Not done","not translated yet","Not done",null,null,null,null,null,null,null,null,72,200046,200046,200046,200046,200046,200046,200046,200046,200046,200046,"Not done","Not done","Not done","Not done","Not done","Not done","Not done",null,null,null,null,"RGB LED Streifen 5m IP68","RGB LED Strip 5m IP68","RGB LED Strip 5m IP68","Ruban led RGB 5m IP68","Tira LED RGB 5m IP68","5m RGB LED pásky IP68 (proti potopení do vody)","RGB strisce LED 5m IP68","RGB LED Streifen 5m IP68","5m RGB LED pásky IP68 (proti potopení do vody)","RGB LED Strip 5m IP68","not translated yet","not translated yet","not translated yet","not translated yet","not translated yet","not translated yet","not translated yet",null,null,null,null,null,89.9,77.5,122,89.9,89.9,2499,89.9,83.61,89.9,89.9,"Not done","Not done","Not done","Not done","Not done","Not done","Not done"]
[200048,"SMA Klebeantenne 868 MHz",14.9,null,null,200048,"SMA Antenna 868 MHz",13.75,null,null,200048,"SMA Antenna 868 MHz",19,null,null,200048,"Antenne SMA 868 MHz",14.9,null,null,200048,"Antena SMA 868 MHz",14.9,null,null,200048,"SMA anténa 868 MHz",371.9,null,null,200048,"SMA antenna 868 MHz",14.9,null,null,200048,"SMA Klebeantenne 868 MHz",20.32,null,null,200048,"SMA anténa 868 MHz",14.9,null,null,200048,"SMA Antenne 868 MHz",14.9,null,null,"Not done","not translated yet","Not done",null,null,"Not done","not translated yet","Not done",null,"Not done","not translated yet","Not done",null,null,"Not done","not translated yet","Not done",null,null,"Not done","not translated yet","Not done",null,null,"Not done","not translated yet","Not done",null,null,"Not done","not translated yet","Not done",null,null,null,null,null,null,null,null,73,200048,200048,200048,200048,200048,200048,200048,200048,200048,200048,"Not done","Not done","Not done","Not done","Not done","Not done","Not done",null,null,null,null,"SMA Klebeantenne 868 MHz","SMA Antenna 868 MHz","SMA Antenna 868 MHz","Antenne SMA 868 MHz","Antena SMA 868 MHz","SMA anténa 868 MHz","SMA antenna 868 MHz","SMA Klebeantenne 868 MHz","SMA anténa 868 MHz","SMA Antenne 868 MHz","not translated yet","not translated yet","not translated yet","not translated yet","not translated yet","not translated yet","not translated yet",null,null,null,null,null,14.9,13.75,19,14.9,14.9,371.9,14.9,20.32,14.9,14.9,"Not done","Not done","Not done","Not done","Not done","Not done","Not done"]
[200049,"Koppelrelais",15.9,null,null,200049,"Coupling Relay",13.75,null,null,200049,"Coupling Relay",23,null,null,200049,"Relai de couplage",15.9,null,null,200049,"Relé de acoplamiento de 16A",15.9,null,null,200049,"Spojovací relé",396.69,null,null,200049,"Relè di accoppiamento",15.9,null,null,200049,"Koppelrelais",20.32,null,null,200049,"Spojovací relé",15.9,null,null,200049,"Koppelrelais",15.9,null,null,"Not done","not translated yet","Not done",null,null,"Not done","not translated yet","Not done",null,"Not done","not translated yet","Not done",null,null,"Not done","not translated yet","Not done",null,null,"Not done","not translated yet","Not done",null,null,"Not done","not translated yet","Not done",null,null,"Not done","not translated yet","Not done",null,null,null,null,null,null,null,null,74,200049,200049,200049,200049,200049,200049,200049,200049,200049,200049,"Not done","Not done","Not done","Not done","Not done","Not done","Not done",null,null,null,null,"Koppelrelais","Coupling Relay","Coupling Relay","Relai de couplage","Relé de acoplamiento de 16A","Spojovací relé","Relè di accoppiamento","Koppelrelais","Spojovací relé","Koppelrelais","not translated yet","not translated yet","not translated yet","not translated yet","not translated yet","not translated yet","not translated yet",null,null,null,null,null,15.9,13.75,23,15.9,15.9,396.69,15.9,20.32,15.9,15.9,"Not done","Not done","Not done","Not done","Not done","Not done","Not done"]
[200050,"Loxone Aufkleber",2.9,null,null,200050,"Loxone Sticker",3,null,null,200050,"Loxone Sticker",5,null,null,200050,"Autocollants Loxone",2.9,null,null,200050,"Adhesivo Loxone",2.9,null,null,200050,"Loxone samolepky",73.55,null,null,200050,"Loxone sticker",2.9,null,null,200050,"Loxone Aufkleber",4.03,null,null,200050,"Loxone samolepky",2.9,null,null,200050,"Loxone Sticker",2.9,null,null,"Not done","not translated yet","Not done",null,null,"Not done","not translated yet","Not done",null,"Not done","not translated yet","Not done",null,null,"Not done","not translated yet","Not done",null,null,"Not done","not translated yet","Not done",null,null,"Not done","not translated yet","Not done",null,null,"Not done","not translated yet","Not done",null,null,null,null,null,null,null,null,75,200050,200050,200050,200050,200050,200050,200050,200050,200050,200050,"Not done","Not done","Not done","Not done","Not done","Not done","Not done",null,null,null,null,"Loxone Aufkleber","Loxone Sticker","Loxone Sticker","Autocollants Loxone","Adhesivo Loxone","Loxone samolepky","Loxone sticker","Loxone Aufkleber","Loxone samolepky","Loxone Sticker","not translated yet","not translated yet","not translated yet","not translated yet","not translated yet","not translated yet","not translated yet",null,null,null,null,null,2.9,3,5,2.9,2.9,73.55,2.9,4.03,2.9,2.9,"Not done","Not done","Not done","Not done","Not done","Not done","Not done"]
[200054,"Ultraschallsensor",209.9,null,null,200054,"Ultrasonic Sensor 0-10V",182.5,null,null,200054,"Ultrasonic Sensor 0-10V",289,null,null,200054,"Capteur ultrason 0-10V",209.9,null,null,200054,"Sensor de ultrasonidos 0-10V",209.9,null,null,200054,"Ultrazvukový senzor 0-10V",5247.11,null,null,200054,"Sensore a ultrasuoni",209.9,null,null,200054,"Ultraschallsensor",267.58999999999997,null,null,200054,"Ultrazvukový senzor 0-10V",209.9,null,null,200054,"Ultrasone Sensor 0-10V",209.9,null,null,"Not done","not translated yet","Not done",null,null,"Not done","not translated yet","Not done",null,"Not done","not translated yet","Not done",null,null,"Not done","not translated yet","Not done",null,null,"Not done","not translated yet","Not done",null,null,"Not done","not translated yet","Not done",null,null,"Not done","not translated yet","Not done",null,null,null,null,null,null,null,null,76,200054,200054,200054,200054,200054,200054,200054,200054,200054,200054,"Not done","Not done","Not done","Not done","Not done","Not done","Not done",null,null,null,null,"Ultraschallsensor","Ultrasonic Sensor 0-10V","Ultrasonic Sensor 0-10V","Capteur ultrason 0-10V","Sensor de ultrasonidos 0-10V","Ultrazvukový senzor 0-10V","Sensore a ultrasuoni","Ultraschallsensor","Ultrazvukový senzor 0-10V","Ultrasone Sensor 0-10V","not translated yet","not translated yet","not translated yet","not translated yet","not translated yet","not translated yet","not translated yet",null,null,null,null,null,209.9,182.5,289,209.9,209.9,5247.11,209.9,267.58999999999997,209.9,209.9,"Not done","Not done","Not done","Not done","Not done","Not done","Not done"]
[200057,"EnOcean Funktaster",45.9,null,null,200057,"Enocean Wireless Switch",41.25,null,null,"not available in this country","not available in this country",0,null,null,200057,"Bouton Poussoir Enocean",45.9,null,null,200057,"Pulsador inalámbrico EnOcean",45.9,null,null,200057,"Enocean Bezdrátové tlačítko",1249,null,null,200057,"EnOcean pulsante a radio",45.9,null,null,"not available in this country","not available in this country",0,null,null,200057,"Enocean Bezdrátové tlačítko",45.9,null,null,200057,"Enocean draadloze drukknop",45.9,null,null,"Not done","not translated yet","Not done",null,null,"Not done","not translated yet","Not done",null,"Not done","not translated yet","Not done",null,null,"Not done","not translated yet","Not done",null,null,"Not done","not translated yet","Not done",null,null,"Not done","not translated yet","Not done",null,null,"Not done","not translated yet","Not done",null,null,null,null,null,null,null,null,77,200057,200057,"not available in this country",200057,200057,200057,200057,"not available in this country",200057,200057,"Not done","Not done","Not done","Not done","Not done","Not done","Not done",null,null,null,null,"EnOcean Funktaster","Enocean Wireless Switch","not available in this country","Bouton Poussoir Enocean","Pulsador inalámbrico EnOcean","Enocean Bezdrátové tlačítko","EnOcean pulsante a radio","not available in this country","Enocean Bezdrátové tlačítko","Enocean draadloze drukknop","not translated yet","not translated yet","not translated yet","not translated yet","not translated yet","not translated yet","not translated yet",null,null,null,null,null,45.9,41.25,0,45.9,45.9,1249,45.9,0,45.9,45.9,"Not done","Not done","Not done","Not done","Not done","Not done","Not done"]
[200059,"EnOcean Fensterkontakt",79.900000000000006,null,null,200059,"Enocean Wireless Window Contact",68.75,null,null,"not available in this country","not available in this country",0,null,null,200059,"Contact d'ouverture Enocean",79.900000000000006,null,null,200059,"Contacto inalámbrico para puertas y ventanas EnOcean",79.900000000000006,null,null,200059,"Enocean Bezdrátový okenní kontakt",2149,null,null,200059,"EnOcean contatto finestra a radio",79.900000000000006,null,null,"not available in this country","not available in this country",0,null,null,200059,"Enocean Bezdrátový okenní kontakt",79.900000000000006,null,null,200059,"Enocean Draadloos Raamcontact",79.900000000000006,null,null,"Not done","not translated yet","Not done",null,null,"Not done","not translated yet","Not done",null,"Not done","not translated yet","Not done",null,null,"Not done","not translated yet","Not done",null,null,"Not done","not translated yet","Not done",null,null,"Not done","not translated yet","Not done",null,null,"Not done","not translated yet","Not done",null,null,null,null,null,null,null,null,78,200059,200059,"not available in this country",200059,200059,200059,200059,"not available in this country",200059,200059,"Not done","Not done","Not done","Not done","Not done","Not done","Not done",null,null,null,null,"EnOcean Fensterkontakt","Enocean Wireless Window Contact","not available in this country","Contact d'ouverture Enocean","Contacto inalámbrico para puertas y ventanas EnOcean","Enocean Bezdrátový okenní kontakt","EnOcean contatto finestra a radio","not available in this country","Enocean Bezdrátový okenní kontakt","Enocean Draadloos Raamcontact","not translated yet","not translated yet","not translated yet","not translated yet","not translated yet","not translated yet","not translated yet",null,null,null,null,null,79.900000000000006,68.75,0,79.900000000000006,79.900000000000006,2149,79.900000000000006,0,79.900000000000006,79.900000000000006,"Not done","Not done","Not done","Not done","Not done","Not done","Not done"]
[200061,"LED Str. WW 5m IP65",84.9,null,null,200061,"Warm White LED Strip 5m IP65",75,null,null,200061,"Warm White LED Strip 5m IP65",115,null,null,200061,"Ruban Blanc Chaud 5m IP65",84.9,null,null,200061,"Tira LED blanco cálido 5m IP65",84.9,null,null,200061,"5m LED pásky (teplá bílá) - IP65 (proti tryskající vodě)",2299,null,null,200061,"Strisce LED WW 5m IP65",84.9,null,null,200061,"LED Str. WW 5m IP65",110.19,null,null,200061,"5m LED pásky (teplá bílá) - IP65 (proti tryskající vodě)",84.9,null,null,200061,"Warm Wit LED Strip 5m IP65",84.9,null,null,"Not done","not translated yet","Not done",null,null,"Not done","not translated yet","Not done",null,"Not done","not translated yet","Not done",null,null,"Not done","not translated yet","Not done",null,null,"Not done","not translated yet","Not done",null,null,"Not done","not translated yet","Not done",null,null,"Not done","not translated yet","Not done",null,null,null,null,null,null,null,null,79,200061,200061,200061,200061,200061,200061,200061,200061,200061,200061,"Not done","Not done","Not done","Not done","Not done","Not done","Not done",null,null,null,null,"LED Str. WW 5m IP65","Warm White LED Strip 5m IP65","Warm White LED Strip 5m IP65","Ruban Blanc Chaud 5m IP65","Tira LED blanco cálido 5m IP65","5m LED pásky (teplá bílá) - IP65 (proti tryskající vodě)","Strisce LED WW 5m IP65","LED Str. WW 5m IP65","5m LED pásky (teplá bílá) - IP65 (proti tryskající vodě)","Warm Wit LED Strip 5m IP65","not translated yet","not translated yet","not translated yet","not translated yet","not translated yet","not translated yet","not translated yet",null,null,null,null,null,84.9,75,115,84.9,84.9,2299,84.9,110.19,84.9,84.9,"Not done","Not done","Not done","Not done","Not done","Not done","Not done"]
[200063,"Elektronischer Schlüssel Leser",9.08,null,null,200063,"iButton Reader 1-Wire",8,null,null,200063,"iButton Reader 1-Wire",13,null,null,200063,"Lecteur iButton",9.08,null,null,200063,"Lector de llaves electrónicas",9.08,null,null,200063,"Čtečka elektronického klíče",230.58,null,null,200063,"Lettore chiave elettronica",9.08,null,null,200063,"Elektronischer Schlüssel Leser",11.44,null,null,200063,"Čtečka elektronického klíče",9.08,null,null,200063,"iButton lezer 1-Wire",9.08,null,null,"Not done","not translated yet","Not done",null,null,"Not done","not translated yet","Not done",null,"Not done","not translated yet","Not done",null,null,"Not done","not translated yet","Not done",null,null,"Not done","not translated yet","Not done",null,null,"Not done","not translated yet","Not done",null,null,"Not done","not translated yet","Not done",null,null,null,null,null,null,null,null,80,200063,200063,200063,200063,200063,200063,200063,200063,200063,200063,"Not done","Not done","Not done","Not done","Not done","Not done","Not done",null,null,null,null,"Elektronischer Schlüssel Leser","iButton Reader 1-Wire","iButton Reader 1-Wire","Lecteur iButton","Lector de llaves electrónicas","Čtečka elektronického klíče","Lettore chiave elettronica","Elektronischer Schlüssel Leser","Čtečka elektronického klíče","iButton lezer 1-Wire","not translated yet","not translated yet","not translated yet","not translated yet","not translated yet","not translated yet","not translated yet",null,null,null,null,null,9.08,8,13,9.08,9.08,230.58,9.08,11.44,9.08,9.08,"Not done","Not done","Not done","Not done","Not done","Not done","Not done"]
[200064,"Elektronischer Schlüssel",3.4,null,null,200064,"iButton Electronic Key Fob",3,null,null,200064,"iButton Electronic Key Fob",5,null,null,200064,"Clé iButton",3.4,null,null,200064,"Llave electrónica iButton",3.4,null,null,200064,"Elektronický klíč",81.819999999999993,null,null,200064,"Chiave elettronica",3.4,null,null,200064,"Elektronischer Schlüssel",4.8600000000000003,null,null,200064,"Elektronický klíč",3.4,null,null,200064,"iButton Electronische sleutel",3.4,null,null,"Not done","not translated yet","Not done",null,null,"Not done","not translated yet","Not done",null,"Not done","not translated yet","Not done",null,null,"Not done","not translated yet","Not done",null,null,"Not done","not translated yet","Not done",null,null,"Not done","not translated yet","Not done",null,null,"Not done","not translated yet","Not done",null,null,null,null,null,null,null,null,81,200064,200064,200064,200064,200064,200064,200064,200064,200064,200064,"Not done","Not done","Not done","Not done","Not done","Not done","Not done",null,null,null,null,"Elektronischer Schlüssel","iButton Electronic Key Fob","iButton Electronic Key Fob","Clé iButton","Llave electrónica iButton","Elektronický klíč","Chiave elettronica","Elektronischer Schlüssel","Elektronický klíč","iButton Electronische sleutel","not translated yet","not translated yet","not translated yet","not translated yet","not translated yet","not translated yet","not translated yet",null,null,null,null,null,3.4,3,5,3.4,3.4,81.819999999999993,3.4,4.8600000000000003,3.4,3.4,"Not done","Not done","Not done","Not done","Not done","Not done","Not done"]
[200067,"EnOcean Stellantrieb",139.9,null,null,200067,"Enocean Wireless Valve Actuator",122.5,null,null,"not available in this country","not available in this country",0,null,null,200067,"Tête thermostatique Enocean",139.9,null,null,200067,"Válvula para radiadores con pilas EnOcean",139.9,null,null,200067,"EnOcean bezdrátová hlavice",3799,null,null,200067,"Valvola termica EnOcean",139.9,null,null,"not available in this country","not available in this country",0,null,null,200067,"EnOcean bezdrátová hlavice",139.9,null,null,200067,"Enocean Draadloos stelventiel",139.9,null,null,"Not done","not translated yet","Not done",null,null,"Not done","not translated yet","Not done",null,"Not done","not translated yet","Not done",null,null,"Not done","not translated yet","Not done",null,null,"Not done","not translated yet","Not done",null,null,"Not done","not translated yet","Not done",null,null,"Not done","not translated yet","Not done",null,null,null,null,null,null,null,null,82,200067,200067,"not available in this country",200067,200067,200067,200067,"not available in this country",200067,200067,"Not done","Not done","Not done","Not done","Not done","Not done","Not done",null,null,null,null,"EnOcean Stellantrieb","Enocean Wireless Valve Actuator","not available in this country","Tête thermostatique Enocean","Válvula para radiadores con pilas EnOcean","EnOcean bezdrátová hlavice","Valvola termica EnOcean","not available in this country","EnOcean bezdrátová hlavice","Enocean Draadloos stelventiel","not translated yet","not translated yet","not translated yet","not translated yet","not translated yet","not translated yet","not translated yet",null,null,null,null,null,139.9,122.5,0,139.9,139.9,3799,139.9,0,139.9,139.9,"Not done","Not done","Not done","Not done","Not done","Not done","Not done"]
[200070,"Elektronischer Schlüssel Magn.",8.25,null,null,200070,"iButton Electronic Key Fob (Magnetic)",7.5,null,null,"not available in this country","not available in this country",0,null,null,200070,"Clé iButton magnétique",8.25,null,null,200070,"Llave electrónica iButton magnética",8.25,null,null,200070,"Elektronický klíč (Magnetický)",205.79,null,null,200070,"Chiave elettronica magnetico",8.25,null,null,200070,"Elektronischer Schlüssel Magn.",11.07,null,null,200070,"Elektronický klíč (Magnetický)",8.25,null,null,200070,"iButton Electronische sleutel (Magnetisch)",8.25,null,null,"Not done","not translated yet","Not done",null,null,"Not done","not translated yet","Not done",null,"Not done","not translated yet","Not done",null,null,"Not done","not translated yet","Not done",null,null,"Not done","not translated yet","Not done",null,null,"Not done","not translated yet","Not done",null,null,"Not done","not translated yet","Not done",null,null,null,null,null,null,null,null,83,200070,200070,"not available in this country",200070,200070,200070,200070,200070,200070,200070,"Not done","Not done","Not done","Not done","Not done","Not done","Not done",null,null,null,null,"Elektronischer Schlüssel Magn.","iButton Electronic Key Fob (Magnetic)","not available in this country","Clé iButton magnétique","Llave electrónica iButton magnética","Elektronický klíč (Magnetický)","Chiave elettronica magnetico","Elektronischer Schlüssel Magn.","Elektronický klíč (Magnetický)","iButton Electronische sleutel (Magnetisch)","not translated yet","not translated yet","not translated yet","not translated yet","not translated yet","not translated yet","not translated yet",null,null,null,null,null,8.25,7.5,0,8.25,8.25,205.79,8.25,11.07,8.25,8.25,"Not done","Not done","Not done","Not done","Not done","Not done","Not done"]
[200077,"1-Wire Hülsen Temperaturfühler",10.9,null,null,200077,"Temperature Probe 1-Wire",10.35,null,null,200077,"Temperature Probe 1-Wire",15.5,null,null,200077,"Sonde de température étanche 1-Wire",10.9,null,null,200077,"Sensor de temperatura 1-Wire metálico",10.9,null,null,200077,"1-Wire teplotní čip v pouzdře",285.39999999999998,null,null,200077,"1-Wire sensore di temperatura a manicotto",10.9,null,null,200077,"1-Wire Hülsen Temperaturfühler",14.4,null,null,200077,"1-Wire teplotní čip v pouzdře",10.9,null,null,200077,"Temperatuurvoeler 1-Wire",10.9,null,null,"Not done","not translated yet","Not done",null,null,"Not done","not translated yet","Not done",null,"Not done","not translated yet","Not done",null,null,"Not done","not translated yet","Not done",null,null,"Not done","not translated yet","Not done",null,null,"Not done","not translated yet","Not done",null,null,"Not done","not translated yet","Not done",null,null,null,null,null,null,null,null,84,200077,200077,200077,200077,200077,200077,200077,200077,200077,200077,"Not done","Not done","Not done","Not done","Not done","Not done","Not done",null,null,null,null,"1-Wire Hülsen Temperaturfühler","Temperature Probe 1-Wire","Temperature Probe 1-Wire","Sonde de température étanche 1-Wire","Sensor de temperatura 1-Wire metálico","1-Wire teplotní čip v pouzdře","1-Wire sensore di temperatura a manicotto","1-Wire Hülsen Temperaturfühler","1-Wire teplotní čip v pouzdře","Temperatuurvoeler 1-Wire","not translated yet","not translated yet","not translated yet","not translated yet","not translated yet","not translated yet","not translated yet",null,null,null,null,null,10.9,10.35,15.5,10.9,10.9,285.39999999999998,10.9,14.4,10.9,10.9,"Not done","Not done","Not done","Not done","Not done","Not done","Not done"]
[200086,"Fanshirt S",12.49,null,null,200086,"Fanshirt S",10.75,null,null,200086,"Fanshirt S",19,null,null,200086,"Fanshirt S",12.49,null,null,200086,"Camiseta Fan S",12.49,null,null,200086,"Loxone Fanshirt S",285.39999999999998,null,null,200086,"Fanshirt S",12.49,null,null,200086,"Fanshirt S",16.62,null,null,200086,"Loxone Fanshirt S",12.49,null,null,200086,"Fanshirt S",12.49,null,null,"Not done","not translated yet","Not done",null,null,"Not done","not translated yet","Not done",null,"Not done","not translated yet","Not done",null,null,"Not done","not translated yet","Not done",null,null,"Not done","not translated yet","Not done",null,null,"Not done","not translated yet","Not done",null,null,"Not done","not translated yet","Not done",null,null,null,null,null,null,null,null,85,200086,200086,200086,200086,200086,200086,200086,200086,200086,200086,"Not done","Not done","Not done","Not done","Not done","Not done","Not done",null,null,null,null,"Fanshirt S","Fanshirt S","Fanshirt S","Fanshirt S","Camiseta Fan S","Loxone Fanshirt S","Fanshirt S","Fanshirt S","Loxone Fanshirt S","Fanshirt S","not translated yet","not translated yet","not translated yet","not translated yet","not translated yet","not translated yet","not translated yet",null,null,null,null,null,12.49,10.75,19,12.49,12.49,285.39999999999998,12.49,16.62,12.49,12.49,"Not done","Not done","Not done","Not done","Not done","Not done","Not done"]
[200087,"Fanshirt M",12.49,null,null,200087,"Fanshirt M",10.75,null,null,200087,"Fanshirt M",19,null,null,200087,"Fanshirt M",12.49,null,null,200087,"Camiseta Fan M",12.49,null,null,200087,"Loxone Fanshirt M",319,null,null,200087,"Fanshirt M",12.49,null,null,200087,"Fanshirt M",16.62,null,null,200087,"Loxone Fanshirt M",12.49,null,null,200087,"Fanshirt M",12.49,null,null,"Not done","not translated yet","Not done",null,null,"Not done","not translated yet","Not done",null,"Not done","not translated yet","Not done",null,null,"Not done","not translated yet","Not done",null,null,"Not done","not translated yet","Not done",null,null,"Not done","not translated yet","Not done",null,null,"Not done","not translated yet","Not done",null,null,null,null,null,null,null,null,86,200087,200087,200087,200087,200087,200087,200087,200087,200087,200087,"Not done","Not done","Not done","Not done","Not done","Not done","Not done",null,null,null,null,"Fanshirt M","Fanshirt M","Fanshirt M","Fanshirt M","Camiseta Fan M","Loxone Fanshirt M","Fanshirt M","Fanshirt M","Loxone Fanshirt M","Fanshirt M","not translated yet","not translated yet","not translated yet","not translated yet","not translated yet","not translated yet","not translated yet",null,null,null,null,null,12.49,10.75,19,12.49,12.49,319,12.49,16.62,12.49,12.49,"Not done","Not done","Not done","Not done","Not done","Not done","Not done"]
[200088,"Fanshirt L",12.49,null,null,200088,"Fanshirt L",10.75,null,null,200088,"Fanshirt L",19,null,null,200088,"Fanshirt L",12.49,null,null,200088,"Camiseta Fan L",12.49,null,null,200088,"Loxone Fanshirt L",319,null,null,200088,"Fanshirt L",12.49,null,null,200088,"Fanshirt L",16.62,null,null,200088,"Loxone Fanshirt L",12.49,null,null,200088,"Fanshirt L",12.49,null,null,"Not done","not translated yet","Not done",null,null,"Not done","not translated yet","Not done",null,"Not done","not translated yet","Not done",null,null,"Not done","not translated yet","Not done",null,null,"Not done","not translated yet","Not done",null,null,"Not done","not translated yet","Not done",null,null,"Not done","not translated yet","Not done",null,null,null,null,null,null,null,null,87,200088,200088,200088,200088,200088,200088,200088,200088,200088,200088,"Not done","Not done","Not done","Not done","Not done","Not done","Not done",null,null,null,null,"Fanshirt L","Fanshirt L","Fanshirt L","Fanshirt L","Camiseta Fan L","Loxone Fanshirt L","Fanshirt L","Fanshirt L","Loxone Fanshirt L","Fanshirt L","not translated yet","not translated yet","not translated yet","not translated yet","not translated yet","not translated yet","not translated yet",null,null,null,null,null,12.49,10.75,19,12.49,12.49,319,12.49,16.62,12.49,12.49,"Not done","Not done","Not done","Not done","Not done","Not done","Not done"]
[200089,"Fanshirt XL",12.49,null,null,200089,"Fanshirt XL",10.75,null,null,200089,"Fanshirt XL",19,null,null,200089,"Fanshirt XL",12.49,null,null,200089,"Camiseta Fan XL",12.49,null,null,200089,"Loxone Fanshirt XL",319,null,null,200089,"Fanshirt XL",12.49,null,null,200089,"Fanshirt XL",16.62,null,null,200089,"Loxone Fanshirt XL",12.49,null,null,200089,"Fanshirt XL",12.49,null,null,"Not done","not translated yet","Not done",null,null,"Not done","not translated yet","Not done",null,"Not done","not translated yet","Not done",null,null,"Not done","not translated yet","Not done",null,null,"Not done","not translated yet","Not done",null,null,"Not done","not translated yet","Not done",null,null,"Not done","not translated yet","Not done",null,null,null,null,null,null,null,null,88,200089,200089,200089,200089,200089,200089,200089,200089,200089,200089,"Not done","Not done","Not done","Not done","Not done","Not done","Not done",null,null,null,null,"Fanshirt XL","Fanshirt XL","Fanshirt XL","Fanshirt XL","Camiseta Fan XL","Loxone Fanshirt XL","Fanshirt XL","Fanshirt XL","Loxone Fanshirt XL","Fanshirt XL","not translated yet","not translated yet","not translated yet","not translated yet","not translated yet","not translated yet","not translated yet",null,null,null,null,null,12.49,10.75,19,12.49,12.49,319,12.49,16.62,12.49,12.49,"Not done","Not done","Not done","Not done","Not done","Not done","Not done"]
[200090,"Fanshirt XXL",12.49,null,null,200090,"Fanshirt XXL",10.75,null,null,200090,"Fanshirt XXL",19,null,null,200090,"Fanshirt XXL",12.49,null,null,200090,"Camiseta Fan XXL",12.49,null,null,200090,"Loxone Fanshirt XXL",319,null,null,200090,"Fanshirt XXL",12.49,null,null,200090,"Fanshirt XXL",16.62,null,null,200090,"Loxone Fanshirt XXL",12.49,null,null,200090,"Fanshirt XXL",12.49,null,null,"Not done","not translated yet","Not done",null,null,"Not done","not translated yet","Not done",null,"Not done","not translated yet","Not done",null,null,"Not done","not translated yet","Not done",null,null,"Not done","not translated yet","Not done",null,null,"Not done","not translated yet","Not done",null,null,"Not done","not translated yet","Not done",null,null,null,null,null,null,null,null,89,200090,200090,200090,200090,200090,200090,200090,200090,200090,200090,"Not done","Not done","Not done","Not done","Not done","Not done","Not done",null,null,null,null,"Fanshirt XXL","Fanshirt XXL","Fanshirt XXL","Fanshirt XXL","Camiseta Fan XXL","Loxone Fanshirt XXL","Fanshirt XXL","Fanshirt XXL","Loxone Fanshirt XXL","Fanshirt XXL","not translated yet","not translated yet","not translated yet","not translated yet","not translated yet","not translated yet","not translated yet",null,null,null,null,null,12.49,10.75,19,12.49,12.49,319,12.49,16.62,12.49,12.49,"Not done","Not done","Not done","Not done","Not done","Not done","Not done"]
[200092,"LED Str. WW 5m IP68",89.9,null,null,200092,"Warm White LED Strip 5m IP68",77.5,null,null,200092,"Warm White LED Strip 5m IP68",115,null,null,200092,"Ruban blanc chaud 5m IP68",89.9,null,null,200092,"Tira LED blanco cálido 5m IP68",89.9,null,null,200092,"5m LED pásky (teplá bílá) - IP68 (proti potopení do vody)",2499,null,null,200092,"Strisce LED WW 5m IP68",89.9,null,null,200092,"LED Str. WW 5m IP68",119.44,null,null,200092,"5m LED pásky (teplá bílá) - IP68 (proti potopení do vody)",89.9,null,null,200092,"Warm Wit LED Strip 5m IP68",89.9,null,null,"Not done","not translated yet","Not done",null,null,"Not done","not translated yet","Not done",null,"Not done","not translated yet","Not done",null,null,"Not done","not translated yet","Not done",null,null,"Not done","not translated yet","Not done",null,null,"Not done","not translated yet","Not done",null,null,"Not done","not translated yet","Not done",null,null,null,null,null,null,null,null,90,200092,200092,200092,200092,200092,200092,200092,200092,200092,200092,"Not done","Not done","Not done","Not done","Not done","Not done","Not done",null,null,null,null,"LED Str. WW 5m IP68","Warm White LED Strip 5m IP68","Warm White LED Strip 5m IP68","Ruban blanc chaud 5m IP68","Tira LED blanco cálido 5m IP68","5m LED pásky (teplá bílá) - IP68 (proti potopení do vody)","Strisce LED WW 5m IP68","LED Str. WW 5m IP68","5m LED pásky (teplá bílá) - IP68 (proti potopení do vody)","Warm Wit LED Strip 5m IP68","not translated yet","not translated yet","not translated yet","not translated yet","not translated yet","not translated yet","not translated yet",null,null,null,null,null,89.9,77.5,115,89.9,89.9,2499,89.9,119.44,89.9,89.9,"Not done","Not done","Not done","Not done","Not done","Not done","Not done"]
[200093,"Loxone Intercom",840.33,null,null,200103,"Loxone Intercom",722.5,null,null,200103,"Loxone Intercom",1149,null,null,200103,"Loxone Intercom",840.33,null,null,200093,"Loxone Intercom",840.33,null,null,200093,"Loxone Intercom",24999,null,null,200093,"Loxone Intercom",840.33,null,null,200093,"Loxone Intercom",897.22,null,null,200093,"Loxone Intercom",840.33,null,null,200093,"Loxone Intercom",840.33,null,null,"Not done","not translated yet","Not done",null,null,"Not done","not translated yet","Not done",null,"Not done","not translated yet","Not done",null,null,"Not done","not translated yet","Not done",null,null,"Not done","not translated yet","Not done",null,null,"Not done","not translated yet","Not done",null,null,"Not done","not translated yet","Not done",null,null,null,null,null,null,null,null,91,200093,200103,200103,200103,200093,200093,200093,200093,200093,200093,"Not done","Not done","Not done","Not done","Not done","Not done","Not done",null,null,null,null,"Loxone Intercom","Loxone Intercom","Loxone Intercom","Loxone Intercom","Loxone Intercom","Loxone Intercom","Loxone Intercom","Loxone Intercom","Loxone Intercom","Loxone Intercom","not translated yet","not translated yet","not translated yet","not translated yet","not translated yet","not translated yet","not translated yet",null,null,null,null,null,840.33,722.5,1149,840.33,840.33,24999,840.33,897.22,840.33,840.33,"Not done","Not done","Not done","Not done","Not done","Not done","Not done"]
[200094,"Intercom Unterputz-Box",55,null,null,200094,"Flush-mounted box for the Loxone intercom",47.5,null,null,200094,"Flush-mounted box for the Loxone intercom",70,null,null,200094,"Boitier d'encastrement Intercom",55,null,null,200094,"Caja para montaje empotrado Loxone Intercom",55,null,null,200094,"Zapuštěný box pro Loxone Intercom",1375,null,null,200094,"Intercom box montaggio a livello",55,null,null,200094,"Intercom Unterputz-Box",70.319999999999993,null,null,200094,"Zapuštěný box pro Loxone Intercom",55,null,null,200094,"Inbouwbehuizing voor Loxone intercom",55,null,null,"Not done","not translated yet","Not done",null,null,"Not done","not translated yet","Not done",null,"Not done","not translated yet","Not done",null,null,"Not done","not translated yet","Not done",null,null,"Not done","not translated yet","Not done",null,null,"Not done","not translated yet","Not done",null,null,"Not done","not translated yet","Not done",null,null,null,null,null,null,null,null,92,200094,200094,200094,200094,200094,200094,200094,200094,200094,200094,"Not done","Not done","Not done","Not done","Not done","Not done","Not done",null,null,null,null,"Intercom Unterputz-Box","Flush-mounted box for the Loxone intercom","Flush-mounted box for the Loxone intercom","Boitier d'encastrement Intercom","Caja para montaje empotrado Loxone Intercom","Zapuštěný box pro Loxone Intercom","Intercom box montaggio a livello","Intercom Unterputz-Box","Zapuštěný box pro Loxone Intercom","Inbouwbehuizing voor Loxone intercom","not translated yet","not translated yet","not translated yet","not translated yet","not translated yet","not translated yet","not translated yet",null,null,null,null,null,55,47.5,70,55,55,1375,55,70.319999999999993,55,55,"Not done","Not done","Not done","Not done","Not done","Not done","Not done"]
[200095,"Intercom Aufputz-Box",100,null,null,200095,"Surface Box for Loxone Intercom",87.5,null,null,200095,"Surface Box for Loxone Intercom",130,null,null,200095,"Boitier applique Intercom",100,null,null,200095,"Caja para montaje en superficie Loxone Intercom",100,null,null,200095,"Povrchový box pro Loxone Intercom",2499,null,null,200095,"Intercom box montaggio sporgente",100,null,null,200095,"Intercom Aufputz-Box",128.69999999999999,null,null,200095,"Povrchový box pro Loxone Intercom",100,null,null,200095,"Opbouwbehuizing voor Loxone Intercom",100,null,null,"Not done","not translated yet","Not done",null,null,"Not done","not translated yet","Not done",null,"Not done","not translated yet","Not done",null,null,"Not done","not translated yet","Not done",null,null,"Not done","not translated yet","Not done",null,null,"Not done","not translated yet","Not done",null,null,"Not done","not translated yet","Not done",null,null,null,null,null,null,null,null,93,200095,200095,200095,200095,200095,200095,200095,200095,200095,200095,"Not done","Not done","Not done","Not done","Not done","Not done","Not done",null,null,null,null,"Intercom Aufputz-Box","Surface Box for Loxone Intercom","Surface Box for Loxone Intercom","Boitier applique Intercom","Caja para montaje en superficie Loxone Intercom","Povrchový box pro Loxone Intercom","Intercom box montaggio sporgente","Intercom Aufputz-Box","Povrchový box pro Loxone Intercom","Opbouwbehuizing voor Loxone Intercom","not translated yet","not translated yet","not translated yet","not translated yet","not translated yet","not translated yet","not translated yet",null,null,null,null,null,100,87.5,130,100,100,2499,100,128.69999999999999,100,100,"Not done","Not done","Not done","Not done","Not done","Not done","Not done"]
[200097,"Loxone Speaker",89,null,null,200097,"Loxone Speaker",77.5,null,null,200097,"Loxone Speaker",117,null,null,200097,"Loxone Speaker",89,null,null,200097,"Loxone Speaker",89,null,null,200097,"Loxone Speaker",2225,null,null,200097,"Loxone Speaker",89,null,null,200097,"Loxone Speaker",110.19,null,null,200097,"Loxone Speaker",89,null,null,200097,"Loxone Speaker",89,null,null,"Not done","not translated yet","Not done",null,null,"Not done","not translated yet","Not done",null,"Not done","not translated yet","Not done",null,null,"Not done","not translated yet","Not done",null,null,"Not done","not translated yet","Not done",null,null,"Not done","not translated yet","Not done",null,null,"Not done","not translated yet","Not done",null,null,null,null,null,null,null,null,94,200097,200097,200097,200097,200097,200097,200097,200097,200097,200097,"Not done","Not done","Not done","Not done","Not done","Not done","Not done",null,null,null,null,"Loxone Speaker","Loxone Speaker","Loxone Speaker","Loxone Speaker","Loxone Speaker","Loxone Speaker","Loxone Speaker","Loxone Speaker","Loxone Speaker","Loxone Speaker","not translated yet","not translated yet","not translated yet","not translated yet","not translated yet","not translated yet","not translated yet",null,null,null,null,null,89,77.5,117,89,89,2225,89,110.19,89,89,"Not done","Not done","Not done","Not done","Not done","Not done","Not done"]
[200098,"RGBW LED Streifen 5 m IP20",109.9,null,null,200098,"RGBW LED Strip 5m IP20",97.5,null,null,200098,"RGBW LED Strip 5m IP20",149,null,null,200098,"Ruban Led RGBW 5m IP20",109.9,null,null,200098,"Tira LED RGBW 5 m IP20",109.9,null,null,200098,"5m RGBW LED pásky IP20 (bez ochrany proti vodě)",2999,null,null,200098,"Strisce RGBW LED 5 m IP20",109.9,null,null,200098,"RGBW LED Streifen 5 m IP20",128.69999999999999,null,null,200098,"5m RGBW LED pásky IP20 (bez ochrany proti vodě)",109.9,null,null,200098,"RGBW LED Strip 5m IP20",109.9,null,null,"Not done","not translated yet","Not done",null,null,"Not done","not translated yet","Not done",null,"Not done","not translated yet","Not done",null,null,"Not done","not translated yet","Not done",null,null,"Not done","not translated yet","Not done",null,null,"Not done","not translated yet","Not done",null,null,"Not done","not translated yet","Not done",null,null,null,null,null,null,null,null,95,200098,200098,200098,200098,200098,200098,200098,200098,200098,200098,"Not done","Not done","Not done","Not done","Not done","Not done","Not done",null,null,null,null,"RGBW LED Streifen 5 m IP20","RGBW LED Strip 5m IP20","RGBW LED Strip 5m IP20","Ruban Led RGBW 5m IP20","Tira LED RGBW 5 m IP20","5m RGBW LED pásky IP20 (bez ochrany proti vodě)","Strisce RGBW LED 5 m IP20","RGBW LED Streifen 5 m IP20","5m RGBW LED pásky IP20 (bez ochrany proti vodě)","RGBW LED Strip 5m IP20","not translated yet","not translated yet","not translated yet","not translated yet","not translated yet","not translated yet","not translated yet",null,null,null,null,null,109.9,97.5,149,109.9,109.9,2999,109.9,128.69999999999999,109.9,109.9,"Not done","Not done","Not done","Not done","Not done","Not done","Not done"]
[200099,"RGBW LED Streifen 5 m IP65",114.9,null,null,200099,"RGBW LED Strip 5m IP65",100,null,null,200099,"RGBW LED Strip 5m IP65",156,null,null,200099,"Ruban Led RGBW 5m IP65",114.9,null,null,200099,"Tira LED RGBW 5 m IP65",114.9,null,null,200099,"5m RGBW LED pásky IP65 (proti tryskající vodě)",3099,null,null,200099,"Strisce RGBW LED 5 m IP65",114.9,null,null,200099,"RGBW LED Streifen 5 m IP65",137.96,null,null,200099,"5m RGBW LED pásky IP65 (proti tryskající vodě)",114.9,null,null,200099,"RGBW LED Strip 5m IP65",114.9,null,null,"Not done","not translated yet","Not done",null,null,"Not done","not translated yet","Not done",null,"Not done","not translated yet","Not done",null,null,"Not done","not translated yet","Not done",null,null,"Not done","not translated yet","Not done",null,null,"Not done","not translated yet","Not done",null,null,"Not done","not translated yet","Not done",null,null,null,null,null,null,null,null,96,200099,200099,200099,200099,200099,200099,200099,200099,200099,200099,"Not done","Not done","Not done","Not done","Not done","Not done","Not done",null,null,null,null,"RGBW LED Streifen 5 m IP65","RGBW LED Strip 5m IP65","RGBW LED Strip 5m IP65","Ruban Led RGBW 5m IP65","Tira LED RGBW 5 m IP65","5m RGBW LED pásky IP65 (proti tryskající vodě)","Strisce RGBW LED 5 m IP65","RGBW LED Streifen 5 m IP65","5m RGBW LED pásky IP65 (proti tryskající vodě)","RGBW LED Strip 5m IP65","not translated yet","not translated yet","not translated yet","not translated yet","not translated yet","not translated yet","not translated yet",null,null,null,null,null,114.9,100,156,114.9,114.9,3099,114.9,137.96,114.9,114.9,"Not done","Not done","Not done","Not done","Not done","Not done","Not done"]
[200100,"RGBW LED Streifen 5 m IP68",119.9,null,null,200100,"RGBW LED Strip 5m IP68",102.5,null,null,200100,"RGBW LED Strip 5m IP68",164,null,null,200100,"Ruban Led RGBW 5m IP68",119.9,null,null,200100,"Tira LED RGBW 5 m IP68",119.9,null,null,200100,"5m RGBW LED pásky IP68 (proti potopení do vody)",3249,null,null,200100,"Strisce RGBW LED 5 m IP68",119.9,null,null,200100,"RGBW LED Streifen 5 m IP68",147.22,null,null,200100,"5m RGBW LED pásky IP68 (proti potopení do vody)",119.9,null,null,200100,"RGBW LED Strip 5m IP68",119.9,null,null,"Not done","not translated yet","Not done",null,null,"Not done","not translated yet","Not done",null,"Not done","not translated yet","Not done",null,null,"Not done","not translated yet","Not done",null,null,"Not done","not translated yet","Not done",null,null,"Not done","not translated yet","Not done",null,null,"Not done","not translated yet","Not done",null,null,null,null,null,null,null,null,97,200100,200100,200100,200100,200100,200100,200100,200100,200100,200100,"Not done","Not done","Not done","Not done","Not done","Not done","Not done",null,null,null,null,"RGBW LED Streifen 5 m IP68","RGBW LED Strip 5m IP68","RGBW LED Strip 5m IP68","Ruban Led RGBW 5m IP68","Tira LED RGBW 5 m IP68","5m RGBW LED pásky IP68 (proti potopení do vody)","Strisce RGBW LED 5 m IP68","RGBW LED Streifen 5 m IP68","5m RGBW LED pásky IP68 (proti potopení do vody)","RGBW LED Strip 5m IP68","not translated yet","not translated yet","not translated yet","not translated yet","not translated yet","not translated yet","not translated yet",null,null,null,null,null,119.9,102.5,164,119.9,119.9,3249,119.9,147.22,119.9,119.9,"Not done","Not done","Not done","Not done","Not done","Not done","Not done"]
[200101,"Wasser Sensor",17,null,null,200101,"Water Sensor",15,null,null,200101,"Water Sensor",23,null,null,200101,"Capteur d'inondation",17,null,null,200101,"Sensor de inundación",17,null,null,200101,"Záplavový senzor",425,null,null,200101,"Sensore acqua",17,null,null,200101,"Wasser Sensor",24.95,null,null,200101,"Záplavový senzor",17,null,null,200101,"Water Sensor",17,null,null,"Not done","not translated yet","Not done",null,null,"Not done","not translated yet","Not done",null,"Not done","not translated yet","Not done",null,null,"Not done","not translated yet","Not done",null,null,"Not done","not translated yet","Not done",null,null,"Not done","not translated yet","Not done",null,null,"Not done","not translated yet","Not done",null,null,null,null,null,null,null,null,98,200101,200101,200101,200101,200101,200101,200101,200101,200101,200101,"Not done","Not done","Not done","Not done","Not done","Not done","Not done",null,null,null,null,"Wasser Sensor","Water Sensor","Water Sensor","Capteur d'inondation","Sensor de inundación","Záplavový senzor","Sensore acqua","Wasser Sensor","Záplavový senzor","Water Sensor","not translated yet","not translated yet","not translated yet","not translated yet","not translated yet","not translated yet","not translated yet",null,null,null,null,null,17,15,23,17,17,425,17,24.95,17,17,"Not done","Not done","Not done","Not done","Not done","Not done","Not done"]
[200107,"Kaltgerätekabel 1,2m",3,null,null,"NA","not available in this country",0,null,null,"not available in this country","not available in this country",0,null,null,"not available in this country","not available in this country",null,null,null,200107,"Cable alimentación 1,2m",3,null,null,"not available in this country","not available in this country",0,null,null,200107,"Cavo di allacciamento 1,2m",3,null,null,"not available in this country","not available in this country",0,null,null,"not available in this country","not available in this country",0,null,null,200107,"Netsnoer 1,2m",3,null,null,"Not done","not translated yet","Not done",null,null,"Not done","not translated yet","Not done",null,"Not done","not translated yet","Not done",null,null,"Not done","not translated yet","Not done",null,null,"Not done","not translated yet","Not done",null,null,"Not done","not translated yet","Not done",null,null,"Not done","not translated yet","Not done",null,null,null,null,null,null,null,null,99,200107,"NA","not available in this country","not available in this country",200107,"not available in this country",200107,"not available in this country","not available in this country",200107,"Not done","Not done","Not done","Not done","Not done","Not done","Not done",null,null,null,null,"Kaltgerätekabel 1,2m","not available in this country","not available in this country","not available in this country","Cable alimentación 1,2m","not available in this country","Cavo di allacciamento 1,2m","not available in this country","not available in this country","Netsnoer 1,2m","not translated yet","not translated yet","not translated yet","not translated yet","not translated yet","not translated yet","not translated yet",null,null,null,null,null,3,0,0,0,3,0,3,0,0,3,"Not done","Not done","Not done","Not done","Not done","Not done","Not done"]
[200109,"1-wire Temperaturfühler Set",39.9,null,null,200109,"Temperature Sensor Set 1-Wire",35,null,null,200109,"Temperature Sensor Set 1-Wire",53.9,null,null,200109,"Kit de sondes de tempréature 1-Wire",39.9,null,null,200109,"Set 5 sensores de Temperatura 1-Wire",39.9,null,null,200109,"1-Wire teplotní senzor set",1049,null,null,200109,"1-wire sensore temperatura set",39.9,null,null,200109,"1-wire Temperaturfühler Set",49.03,null,null,200109,"1-Wire teplotní senzor set",39.9,null,null,200109,"Temperatuur Sensor Set 1-Wire",39.9,null,null,"Not done","not translated yet","Not done",null,null,"Not done","not translated yet","Not done",null,"Not done","not translated yet","Not done",null,null,"Not done","not translated yet","Not done",null,null,"Not done","not translated yet","Not done",null,null,"Not done","not translated yet","Not done",null,null,"Not done","not translated yet","Not done",null,null,null,null,null,null,null,null,100,200109,200109,200109,200109,200109,200109,200109,200109,200109,200109,"Not done","Not done","Not done","Not done","Not done","Not done","Not done",null,null,null,null,"1-wire Temperaturfühler Set","Temperature Sensor Set 1-Wire","Temperature Sensor Set 1-Wire","Kit de sondes de tempréature 1-Wire","Set 5 sensores de Temperatura 1-Wire","1-Wire teplotní senzor set","1-wire sensore temperatura set","1-wire Temperaturfühler Set","1-Wire teplotní senzor set","Temperatuur Sensor Set 1-Wire","not translated yet","not translated yet","not translated yet","not translated yet","not translated yet","not translated yet","not translated yet",null,null,null,null,null,39.9,35,53.9,39.9,39.9,1049,39.9,49.03,39.9,39.9,"Not done","Not done","Not done","Not done","Not done","Not done","Not done"]
[200110,"Loxone 12-Kanal Verstärker",599,null,null,200110,"Loxone 12 Channel Amplifier",515,null,null,200110,"Loxone 12 Channel Amplifier",999,null,null,200110,"Amplificateur 12 canaux",599,null,null,200110,"Amplificador Loxone 12-Canales",599,null,null,200110,"Loxone 12ti kanálový zesilovač",15999,null,null,200110,"Loxone amplificatore 12 canali",599,null,null,200110,"Loxone 12-Kanal Verstärker",739.82,null,null,200110,"Loxone 12ti kanálový zesilovač",599,null,null,200110,"Loxone 12 Kanaal Versterker",599,null,null,"Not done","not translated yet","Not done",null,null,"Not done","not translated yet","Not done",null,"Not done","not translated yet","Not done",null,null,"Not done","not translated yet","Not done",null,null,"Not done","not translated yet","Not done",null,null,"Not done","not translated yet","Not done",null,null,"Not done","not translated yet","Not done",null,null,null,null,null,null,null,null,101,200110,200110,200110,200110,200110,200110,200110,200110,200110,200110,"Not done","Not done","Not done","Not done","Not done","Not done","Not done",null,null,null,null,"Loxone 12-Kanal Verstärker","Loxone 12 Channel Amplifier","Loxone 12 Channel Amplifier","Amplificateur 12 canaux","Amplificador Loxone 12-Canales","Loxone 12ti kanálový zesilovač","Loxone amplificatore 12 canali","Loxone 12-Kanal Verstärker","Loxone 12ti kanálový zesilovač","Loxone 12 Kanaal Versterker","not translated yet","not translated yet","not translated yet","not translated yet","not translated yet","not translated yet","not translated yet",null,null,null,null,null,599,515,999,599,599,15999,599,739.82,599,599,"Not done","Not done","Not done","Not done","Not done","Not done","Not done"]
[200112,"Bewegungsmelder 24V (Aussenbereich)",99.6,null,null,200112,"Outside Motion Sensor (24V)",87.5,null,null,200112,"Outside Motion Sensor (24V)",135,null,null,200112,"Détecteur de présence extérieur (24V)",99.6,null,null,200112,"Detector de presencia para exterior 24V",99.6,null,null,200112,"Senzor pohybu 24V (venkovní)",2499,null,null,200112,"Sensore movimento 24V",99.6,null,null,200112,"Bewegungsmelder 24V (Aussenbereich)",119.44,null,null,200112,"Senzor pohybu 24V (venkovní)",99.6,null,null,200112,"Buitenbewegingsmelder (24V)",99.6,null,null,"Not done","not translated yet","Not done",null,null,"Not done","not translated yet","Not done",null,"Not done","not translated yet","Not done",null,null,"Not done","not translated yet","Not done",null,null,"Not done","not translated yet","Not done",null,null,"Not done","not translated yet","Not done",null,null,"Not done","not translated yet","Not done",null,null,null,null,null,null,null,null,102,200112,200112,200112,200112,200112,200112,200112,200112,200112,200112,"Not done","Not done","Not done","Not done","Not done","Not done","Not done",null,null,null,null,"Bewegungsmelder 24V (Aussenbereich)","Outside Motion Sensor (24V)","Outside Motion Sensor (24V)","Détecteur de présence extérieur (24V)","Detector de presencia para exterior 24V","Senzor pohybu 24V (venkovní)","Sensore movimento 24V","Bewegungsmelder 24V (Aussenbereich)","Senzor pohybu 24V (venkovní)","Buitenbewegingsmelder (24V)","not translated yet","not translated yet","not translated yet","not translated yet","not translated yet","not translated yet","not translated yet",null,null,null,null,null,99.6,87.5,135,99.6,99.6,2499,99.6,119.44,99.6,99.6,"Not done","Not done","Not done","Not done","Not done","Not done","Not done"]
[200113,"Fensterkontakt Loxone",9.9,null,null,200113,"Window & Door Contact",8.5,null,null,200113,"Window & Door Contact",13.5,null,null,200113,"Contact d'ouverture porte / fenêtre",9.9,null,null,200113,"Contacto de ventana Loxone",9.9,null,null,200113,"Okenní kontakt",259,null,null,200113,"Contatto finestra Loxone",9.9,null,null,200113,"Fensterkontakt Loxone",12.27,null,null,200113,"Okenní kontakt",9.9,null,null,200113,"Raam- /Deurcontact",9.9,null,null,"Not done","not translated yet","Not done",null,null,"Not done","not translated yet","Not done",null,"Not done","not translated yet","Not done",null,null,"Not done","not translated yet","Not done",null,null,"Not done","not translated yet","Not done",null,null,"Not done","not translated yet","Not done",null,null,"Not done","not translated yet","Not done",null,null,null,null,null,null,null,null,103,200113,200113,200113,200113,200113,200113,200113,200113,200113,200113,"Not done","Not done","Not done","Not done","Not done","Not done","Not done",null,null,null,null,"Fensterkontakt Loxone","Window & Door Contact","Window & Door Contact","Contact d'ouverture porte / fenêtre","Contacto de ventana Loxone","Okenní kontakt","Contatto finestra Loxone","Fensterkontakt Loxone","Okenní kontakt","Raam- /Deurcontact","not translated yet","not translated yet","not translated yet","not translated yet","not translated yet","not translated yet","not translated yet",null,null,null,null,null,9.9,8.5,13.5,9.9,9.9,259,9.9,12.27,9.9,9.9,"Not done","Not done","Not done","Not done","Not done","Not done","Not done"]
[200129,"Loxone CAT7 Kabel (250 m)",172.5,null,null,200129,"Loxone Cat 7 Cable",147.5,null,null,200129,"Loxone Cat 7 Cable (820ft)",265,null,null,200129,"Câble Cat 7",172.5,null,null,200129,"Cable CAT7 Loxone (250 m)",172.5,null,null,200129,"Loxone Cat 7 kabel",4699,null,null,200129,"Loxone cavo CAT7 (250 m)",172.5,null,null,200129,"Loxone CAT7 Kabel (250 m)",212.04,null,null,200129,"Loxone Cat 7 kabel",172.5,null,null,200129,"Loxone Cat 7 Kabel",172.5,null,null,"Not done","not translated yet","Not done",null,null,"Not done","not translated yet","Not done",null,"Not done","not translated yet","Not done",null,null,"Not done","not translated yet","Not done",null,null,"Not done","not translated yet","Not done",null,null,"Not done","not translated yet","Not done",null,null,"Not done","not translated yet","Not done",null,null,null,null,null,null,null,null,104,200129,200129,200129,200129,200129,200129,200129,200129,200129,200129,"Not done","Not done","Not done","Not done","Not done","Not done","Not done",null,null,null,null,"Loxone CAT7 Kabel (250 m)","Loxone Cat 7 Cable","Loxone Cat 7 Cable (820ft)","Câble Cat 7","Cable CAT7 Loxone (250 m)","Loxone Cat 7 kabel","Loxone cavo CAT7 (250 m)","Loxone CAT7 Kabel (250 m)","Loxone Cat 7 kabel","Loxone Cat 7 Kabel","not translated yet","not translated yet","not translated yet","not translated yet","not translated yet","not translated yet","not translated yet",null,null,null,null,null,172.5,147.5,265,172.5,172.5,4699,172.5,212.04,172.5,172.5,"Not done","Not done","Not done","Not done","Not done","Not done","Not done"]
[0,"No longer sold",0,null,null,200135,"Enocean Motion Sensor",95,null,null,"not available in this country","not available in this country",0,null,null,200135,"Détecteur de présence EnOcean",109.9,null,null,200135,"Detector de presencia inalámbrico EnOcean",109.9,null,null,200135,"Enocean Bezdrátový pohybový senzor",4049,null,null,200135,"EnOcean sensore di movimento",109.9,null,null,200135,"EnOcean Bewegungsmelder",137.96,null,null,200135,"Enocean Bezdrátový pohybový senzor",109.9,null,null,200135,"Enocean Bewegingsmelder",109.9,null,null,"Not done","not translated yet","Not done",null,null,"Not done","not translated yet","Not done",null,"Not done","not translated yet","Not done",null,null,"Not done","not translated yet","Not done",null,null,"Not done","not translated yet","Not done",null,null,"Not done","not translated yet","Not done",null,null,"Not done","not translated yet","Not done",null,null,null,null,null,null,null,null,105,0,200135,"not available in this country",200135,200135,200135,200135,200135,200135,200135,"Not done","Not done","Not done","Not done","Not done","Not done","Not done",null,null,null,null,"No longer sold","Enocean Motion Sensor","not available in this country","Détecteur de présence EnOcean","Detector de presencia inalámbrico EnOcean","Enocean Bezdrátový pohybový senzor","EnOcean sensore di movimento","EnOcean Bewegungsmelder","Enocean Bezdrátový pohybový senzor","Enocean Bewegingsmelder","not translated yet","not translated yet","not translated yet","not translated yet","not translated yet","not translated yet","not translated yet",null,null,null,null,null,0,95,0,109.9,109.9,4049,109.9,137.96,109.9,109.9,"Not done","Not done","Not done","Not done","Not done","Not done","Not done"]
[200136,"Temp-/Feuchtefühler Sauna",149.9,null,null,200136,"Temperature & Humidity Sensor For Saunas",127.5,null,null,200136,"Temperature & Humidity Sensor For Saunas",205,null,null,200136,"Sonde de Temp & Hum pour Sauna",149.9,null,null,200136,"Sensor de temperatura y humedad para Sauna",149.9,null,null,200136,"Saunový senzor teplota/vlhkost",3999,null,null,200136,"Sensore temperatura/umidità sauna",149.9,null,null,200136,"Temp-/Feuchtefühler Sauna",184.26,null,null,200136,"Saunový senzor teplota/vlhkost",149.9,null,null,200136,"Temperatuur- & Vochtigheidsvoeler Sauna",149.9,null,null,"Not done","not translated yet","Not done",null,null,"Not done","not translated yet","Not done",null,"Not done","not translated yet","Not done",null,null,"Not done","not translated yet","Not done",null,null,"Not done","not translated yet","Not done",null,null,"Not done","not translated yet","Not done",null,null,"Not done","not translated yet","Not done",null,null,null,null,null,null,null,null,106,200136,200136,200136,200136,200136,200136,200136,200136,200136,200136,"Not done","Not done","Not done","Not done","Not done","Not done","Not done",null,null,null,null,"Temp-/Feuchtefühler Sauna","Temperature & Humidity Sensor For Saunas","Temperature & Humidity Sensor For Saunas","Sonde de Temp & Hum pour Sauna","Sensor de temperatura y humedad para Sauna","Saunový senzor teplota/vlhkost","Sensore temperatura/umidità sauna","Temp-/Feuchtefühler Sauna","Saunový senzor teplota/vlhkost","Temperatuur- & Vochtigheidsvoeler Sauna","not translated yet","not translated yet","not translated yet","not translated yet","not translated yet","not translated yet","not translated yet",null,null,null,null,null,149.9,127.5,205,149.9,149.9,3999,149.9,184.26,149.9,149.9,"Not done","Not done","Not done","Not done","Not done","Not done","Not done"]
[0,"No longer sold",0,null,null,200137,"Enocean Relay",65,null,null,"not available in this country","not available in this country",0,null,null,200137,"Actionneur EnOcean",74.900000000000006,null,null,200137,"Actuador inalámbrico EnOcean",74.900000000000006,null,null,200137,"EnOcean bezdrátový aktor",1999,null,null,200137,"EnOcean relè",74.900000000000006,null,null,200137,"EnOcean Schaltaktor",100.93,null,null,200137,"EnOcean bezdrátový aktor",74.900000000000006,null,null,200137,"Enocean Relais",74.900000000000006,null,null,"Not done","not translated yet","Not done",null,null,"Not done","not translated yet","Not done",null,"Not done","not translated yet","Not done",null,null,"Not done","not translated yet","Not done",null,null,"Not done","not translated yet","Not done",null,null,"Not done","not translated yet","Not done",null,null,"Not done","not translated yet","Not done",null,null,null,null,null,null,null,null,107,0,200137,"not available in this country",200137,200137,200137,200137,200137,200137,200137,"Not done","Not done","Not done","Not done","Not done","Not done","Not done",null,null,null,null,"No longer sold","Enocean Relay","not available in this country","Actionneur EnOcean","Actuador inalámbrico EnOcean","EnOcean bezdrátový aktor","EnOcean relè","EnOcean Schaltaktor","EnOcean bezdrátový aktor","Enocean Relais","not translated yet","not translated yet","not translated yet","not translated yet","not translated yet","not translated yet","not translated yet",null,null,null,null,null,0,65,0,74.900000000000006,74.900000000000006,1999,74.900000000000006,100.93,74.900000000000006,74.900000000000006,"Not done","Not done","Not done","Not done","Not done","Not done","Not done"]
[200143,"Netzteil 24V, 0,4A",26.9,null,null,200143,"24V Power Supply (0.4A)",25,null,null,200143,"24V Power Supply (0.4A)",36,null,null,200143,"Alimentation 24V 0,4A",26.9,null,null,200143,"Fuente de alimentación 24V, 0,4A",26.9,null,null,200143,"Zdroj 24V, 0,4A",749,null,null,200143,"Alimentatore 24V 0,4A",26.9,null,null,200143,"Netzteil 24V, 0,4A",33.29,null,null,200143,"Zdroj 24V, 0,4A",26.9,null,null,200143,"24V Voeding (0.4A)",26.9,null,null,"Not done","not translated yet","Not done",null,null,"Not done","not translated yet","Not done",null,"Not done","not translated yet","Not done",null,null,"Not done","not translated yet","Not done",null,null,"Not done","not translated yet","Not done",null,null,"Not done","not translated yet","Not done",null,null,"Not done","not translated yet","Not done",null,null,null,null,null,null,null,null,108,200143,200143,200143,200143,200143,200143,200143,200143,200143,200143,"Not done","Not done","Not done","Not done","Not done","Not done","Not done",null,null,null,null,"Netzteil 24V, 0,4A","24V Power Supply (0.4A)","24V Power Supply (0.4A)","Alimentation 24V 0,4A","Fuente de alimentación 24V, 0,4A","Zdroj 24V, 0,4A","Alimentatore 24V 0,4A","Netzteil 24V, 0,4A","Zdroj 24V, 0,4A","24V Voeding (0.4A)","not translated yet","not translated yet","not translated yet","not translated yet","not translated yet","not translated yet","not translated yet",null,null,null,null,null,26.9,25,36,26.9,26.9,749,26.9,33.29,26.9,26.9,"Not done","Not done","Not done","Not done","Not done","Not done","Not done"]
[200150,"Loxone Speaker Einbaubox",42.9,null,null,200150,"Loxone Speaker Back Box",37.5,null,null,200150,"Loxone Speaker Back Box",58,null,null,200150,"Loxone Speaker Back Box",42.9,null,null,200150,"Caja para empotrar Loxone Speaker",42.9,null,null,200150,"Instalační box pro Loxone reproduktor (speaker)",1199,null,null,200150,"Loxone Speaker box incasso",42.9,null,null,200150,"Loxone Speaker Einbaubox",57.36,null,null,200150,"Instalační box pro Loxone reproduktor (speaker)",42.9,null,null,200150,"Inbouwdoos Loxone Speaker",42.9,null,null,"Not done","not translated yet","Not done",null,null,"Not done","not translated yet","Not done",null,"Not done","not translated yet","Not done",null,null,"Not done","not translated yet","Not done",null,null,"Not done","not translated yet","Not done",null,null,"Not done","not translated yet","Not done",null,null,"Not done","not translated yet","Not done",null,null,null,null,null,null,null,null,109,200150,200150,200150,200150,200150,200150,200150,200150,200150,200150,"Not done","Not done","Not done","Not done","Not done","Not done","Not done",null,null,null,null,"Loxone Speaker Einbaubox","Loxone Speaker Back Box","Loxone Speaker Back Box","Loxone Speaker Back Box","Caja para empotrar Loxone Speaker","Instalační box pro Loxone reproduktor (speaker)","Loxone Speaker box incasso","Loxone Speaker Einbaubox","Instalační box pro Loxone reproduktor (speaker)","Inbouwdoos Loxone Speaker","not translated yet","not translated yet","not translated yet","not translated yet","not translated yet","not translated yet","not translated yet",null,null,null,null,null,42.9,37.5,58,42.9,42.9,1199,42.9,57.36,42.9,42.9,"Not done","Not done","Not done","Not done","Not done","Not done","Not done"]
[200151,"SMA Stabantenne 4dBi 868 MHz",20.75,null,null,200151,"SMA Antenna 4dBi 868 MHz",18.75,null,null,200151,"SMA Antenna 4dBi 868 MHz",29.9,null,null,200151,"Antenne SMA 4dBi 868 MHz",20.75,null,null,200151,"Antena de varilla SMA 4dBi 868 MHz",20.75,null,null,200151,"SMA Anténa 4dBi 868 MHz",579,null,null,200151,"SMA antenna 4dBi 868 MHz",20.75,null,null,200151,"SMA Stabantenne 4dBi 868 MHz",24.95,null,null,200151,"SMA Anténa 4dBi 868 MHz",20.75,null,null,200151,"SMA Antenne 4dBi 868 MHz",20.75,null,null,"Not done","not translated yet","Not done",null,null,"Not done","not translated yet","Not done",null,"Not done","not translated yet","Not done",null,null,"Not done","not translated yet","Not done",null,null,"Not done","not translated yet","Not done",null,null,"Not done","not translated yet","Not done",null,null,"Not done","not translated yet","Not done",null,null,null,null,null,null,null,null,110,200151,200151,200151,200151,200151,200151,200151,200151,200151,200151,"Not done","Not done","Not done","Not done","Not done","Not done","Not done",null,null,null,null,"SMA Stabantenne 4dBi 868 MHz","SMA Antenna 4dBi 868 MHz","SMA Antenna 4dBi 868 MHz","Antenne SMA 4dBi 868 MHz","Antena de varilla SMA 4dBi 868 MHz","SMA Anténa 4dBi 868 MHz","SMA antenna 4dBi 868 MHz","SMA Stabantenne 4dBi 868 MHz","SMA Anténa 4dBi 868 MHz","SMA Antenne 4dBi 868 MHz","not translated yet","not translated yet","not translated yet","not translated yet","not translated yet","not translated yet","not translated yet",null,null,null,null,null,20.75,18.75,29.9,20.75,20.75,579,20.75,24.95,20.75,20.75,"Not done","Not done","Not done","Not done","Not done","Not done","Not done"]
[200153,"Loxone Wall Speaker",110,null,null,200153,"Loxone Wall Speaker",95,null,null,200153,"Loxone Wall Speaker",149,null,null,200153,"Loxone Wall Speaker",110,null,null,200153,"Loxone Wall Speaker",110,null,null,200153,"Loxone Wall Speaker",3099,null,null,200153,"Loxone Wall Speaker",110,null,null,200153,"Loxone Wall Speaker",184.26,null,null,200153,"Loxone Wall Speaker",110,null,null,200153,"Loxone Wall Speaker",110,null,null,"Not done","not translated yet","Not done",null,null,"Not done","not translated yet","Not done",null,"Not done","not translated yet","Not done",null,null,"Not done","not translated yet","Not done",null,null,"Not done","not translated yet","Not done",null,null,"Not done","not translated yet","Not done",null,null,"Not done","not translated yet","Not done",null,null,null,null,null,null,null,null,111,200153,200153,200153,200153,200153,200153,200153,200153,200153,200153,"Not done","Not done","Not done","Not done","Not done","Not done","Not done",null,null,null,null,"Loxone Wall Speaker","Loxone Wall Speaker","Loxone Wall Speaker","Loxone Wall Speaker","Loxone Wall Speaker","Loxone Wall Speaker","Loxone Wall Speaker","Loxone Wall Speaker","Loxone Wall Speaker","Loxone Wall Speaker","not translated yet","not translated yet","not translated yet","not translated yet","not translated yet","not translated yet","not translated yet",null,null,null,null,null,110,95,149,110,110,3099,110,184.26,110,110,"Not done","Not done","Not done","Not done","Not done","Not done","Not done"]
[200154,"Drucksensor 0-10V",104.9,null,null,200154,"Pressure Sensor 0-10V",90,null,null,200154,"Pressure Sensor 0-10V",115,null,null,200154,"Sonde de pression 0-10V",104.9,null,null,200154,"Sensor de presión 0-10V",104.9,null,null,200154,"Senzor tlaku 0-10V",2849,null,null,200154,"Sensore pressione 0-10V",104.9,null,null,200154,"Drucksensor 0-10V",137.96,null,null,200154,"Senzor tlaku 0-10V",104.9,null,null,200154,"Druksensor 0-10V",104.9,null,null,"Not done","not translated yet","Not done",null,null,"Not done","not translated yet","Not done",null,"Not done","not translated yet","Not done",null,null,"Not done","not translated yet","Not done",null,null,"Not done","not translated yet","Not done",null,null,"Not done","not translated yet","Not done",null,null,"Not done","not translated yet","Not done",null,null,null,null,null,null,null,null,112,200154,200154,200154,200154,200154,200154,200154,200154,200154,200154,"Not done","Not done","Not done","Not done","Not done","Not done","Not done",null,null,null,null,"Drucksensor 0-10V","Pressure Sensor 0-10V","Pressure Sensor 0-10V","Sonde de pression 0-10V","Sensor de presión 0-10V","Senzor tlaku 0-10V","Sensore pressione 0-10V","Drucksensor 0-10V","Senzor tlaku 0-10V","Druksensor 0-10V","not translated yet","not translated yet","not translated yet","not translated yet","not translated yet","not translated yet","not translated yet",null,null,null,null,null,104.9,90,115,104.9,104.9,2849,104.9,137.96,104.9,104.9,"Not done","Not done","Not done","Not done","Not done","Not done","Not done"]
[200155,"Glasbruchmelder 24V",24.9,null,null,200155,"Glass Break Sensor 24V",22.5,null,null,200155,"Glass Break Sensor 24V",34,null,null,200155,"Détecteur bris de glace 24V",24.9,null,null,200155,"Detector de rotura de cristal 24V",24.9,null,null,200155,"Senzor rozbití okna 24V",699,null,null,200155,"Sensore rottura vetro 24V",24.9,null,null,200155,"Glasbruchmelder 24V",33.29,null,null,200155,"Senzor rozbití okna 24V",24.9,null,null,200155,"Glasbreuksensor 24V",24.9,null,null,"Not done","not translated yet","Not done",null,null,"Not done","not translated yet","Not done",null,"Not done","not translated yet","Not done",null,null,"Not done","not translated yet","Not done",null,null,"Not done","not translated yet","Not done",null,null,"Not done","not translated yet","Not done",null,null,"Not done","not translated yet","Not done",null,null,null,null,null,null,null,null,113,200155,200155,200155,200155,200155,200155,200155,200155,200155,200155,"Not done","Not done","Not done","Not done","Not done","Not done","Not done",null,null,null,null,"Glasbruchmelder 24V","Glass Break Sensor 24V","Glass Break Sensor 24V","Détecteur bris de glace 24V","Detector de rotura de cristal 24V","Senzor rozbití okna 24V","Sensore rottura vetro 24V","Glasbruchmelder 24V","Senzor rozbití okna 24V","Glasbreuksensor 24V","not translated yet","not translated yet","not translated yet","not translated yet","not translated yet","not translated yet","not translated yet",null,null,null,null,null,24.9,22.5,34,24.9,24.9,699,24.9,33.29,24.9,24.9,"Not done","Not done","Not done","Not done","Not done","Not done","Not done"]
[200156,"Modbus Energiezähler 1-phasig",139,null,null,200156,"Modbus Electricity Meter (Single Phase)",120,null,null,"not available in this country","not available in this country",0,null,null,200156,"Compteur d'énergie Modbus monophasé",139,null,null,200156,"Contador de energía Modbus monofásico",139,null,null,200156,"1-fázový elektroměr (Modbus)",3799,null,null,200156,"Modbus contatore energia 1-fase",139,null,null,200156,"Modbus Energiezähler 1-phasig",184.26,null,null,200156,"1-fázový elektroměr (Modbus)",139,null,null,200156,"Modbus energieteller 1-fasig",139,null,null,"Not done","not translated yet","Not done",null,null,"Not done","not translated yet","Not done",null,"Not done","not translated yet","Not done",null,null,"Not done","not translated yet","Not done",null,null,"Not done","not translated yet","Not done",null,null,"Not done","not translated yet","Not done",null,null,"Not done","not translated yet","Not done",null,null,null,null,null,null,null,null,114,200156,200156,"not available in this country",200156,200156,200156,200156,200156,200156,200156,"Not done","Not done","Not done","Not done","Not done","Not done","Not done",null,null,null,null,"Modbus Energiezähler 1-phasig","Modbus Electricity Meter (Single Phase)","not available in this country","Compteur d'énergie Modbus monophasé","Contador de energía Modbus monofásico","1-fázový elektroměr (Modbus)","Modbus contatore energia 1-fase","Modbus Energiezähler 1-phasig","1-fázový elektroměr (Modbus)","Modbus energieteller 1-fasig","not translated yet","not translated yet","not translated yet","not translated yet","not translated yet","not translated yet","not translated yet",null,null,null,null,null,139,120,0,139,139,3799,139,184.26,139,139,"Not done","Not done","Not done","Not done","Not done","Not done","Not done"]
[200157,"Modbus Energiezähler 3-phasig",249,null,null,200157,"Modbus Electricity Meter (Three Phase)",212.5,null,null,"not available in this country","not available in this country",0,null,null,200157,"Compteur d'énergie Modbus triphasé",249,null,null,200157,"Contador de energía Modbus trifásico",249,null,null,200157,"3-fázový elektroměr (Modbus)",6799,null,null,200157,"Modbus contatore energia 3-fasi",249,null,null,200157,"Modbus Energiezähler 3-phasig",313.89,null,null,200157,"3-fázový elektroměr (Modbus)",249,null,null,200157,"Modbus energieteller 3-fasig",249,null,null,"Not done","not translated yet","Not done",null,null,"Not done","not translated yet","Not done",null,"Not done","not translated yet","Not done",null,null,"Not done","not translated yet","Not done",null,null,"Not done","not translated yet","Not done",null,null,"Not done","not translated yet","Not done",null,null,"Not done","not translated yet","Not done",null,null,null,null,null,null,null,null,115,200157,200157,"not available in this country",200157,200157,200157,200157,200157,200157,200157,"Not done","Not done","Not done","Not done","Not done","Not done","Not done",null,null,null,null,"Modbus Energiezähler 3-phasig","Modbus Electricity Meter (Three Phase)","not available in this country","Compteur d'énergie Modbus triphasé","Contador de energía Modbus trifásico","3-fázový elektroměr (Modbus)","Modbus contatore energia 3-fasi","Modbus Energiezähler 3-phasig","3-fázový elektroměr (Modbus)","Modbus energieteller 3-fasig","not translated yet","not translated yet","not translated yet","not translated yet","not translated yet","not translated yet","not translated yet",null,null,null,null,null,249,212.5,0,249,249,6799,249,313.89,249,249,"Not done","Not done","Not done","Not done","Not done","Not done","Not done"]
[200158,"Baustellenschild",199,null,null,"NA","not available in this country",0,null,null,"not available in this country","not available in this country",0,null,null,"not available in this country","not available in this country",199,null,null,"not available in this country","not available in this country",0,"NO AVAIABLE IN LOXONE SHOP ES",null,"not available in this country","not available in this country",0,null,null,200158,"Espositore cantiere",199,null,null,200158,"Baustellenschild",184.26,null,null,"not available in this country","not available in this country",0,null,null,200158,"Bouwborden",199,null,null,"Not done","not translated yet","Not done",null,null,"Not done","not translated yet","Not done",null,"Not done","not translated yet","Not done",null,null,"Not done","not translated yet","Not done",null,null,"Not done","not translated yet","Not done",null,null,"Not done","not translated yet","Not done",null,null,"Not done","not translated yet","Not done",null,null,null,null,null,null,null,null,116,200158,"NA","not available in this country","not available in this country","not available in this country","not available in this country",200158,200158,"not available in this country",200158,"Not done","Not done","Not done","Not done","Not done","Not done","Not done",null,null,null,null,"Baustellenschild","not available in this country","not available in this country","not available in this country","not available in this country","not available in this country","Espositore cantiere","Baustellenschild","not available in this country","Bouwborden","not translated yet","not translated yet","not translated yet","not translated yet","not translated yet","not translated yet","not translated yet",null,null,null,null,null,199,0,0,199,0,0,199,184.26,0,199,"Not done","Not done","Not done","Not done","Not done","Not done","Not done"]
[200168,"Potenzialverteiler PPV8 (20 Stk.)",195,null,null,200168,"Push In Terminal Block 8x4 Interconnected (20 pcs)",165,null,null,200168,"Push In Terminal Block 8x4 Interconnected (20 pcs)",265,null,null,200168,"Bornier 8x4 interconnectés (20 pcs)",195,null,null,200168,"Borne para distribuidor de potencial 8x4 PPV8",195,null,null,200168,"Svorka na DIN lištu PPV8 (20 kusů)",5499,null,null,200168,"Ripartitori di potenziale PPV8 (20pz.)",195,null,null,200168,"Potenzialverteiler PPV8 (20 Stk.)",202.78,null,null,200168,"Svorka na DIN lištu PPV8 (20 kusů)",195,null,null,200168,"Potentieel verdeler PPV8 (20 stuks)",195,null,null,"Not done","not translated yet","Not done",null,null,"Not done","not translated yet","Not done",null,"Not done","not translated yet","Not done",null,null,"Not done","not translated yet","Not done",null,null,"Not done","not translated yet","Not done",null,null,"Not done","not translated yet","Not done",null,null,"Not done","not translated yet","Not done",null,null,null,null,null,null,null,null,117,200168,200168,200168,200168,200168,200168,200168,200168,200168,200168,"Not done","Not done","Not done","Not done","Not done","Not done","Not done",null,null,null,null,"Potenzialverteiler PPV8 (20 Stk.)","Push In Terminal Block 8x4 Interconnected (20 pcs)","Push In Terminal Block 8x4 Interconnected (20 pcs)","Bornier 8x4 interconnectés (20 pcs)","Borne para distribuidor de potencial 8x4 PPV8","Svorka na DIN lištu PPV8 (20 kusů)","Ripartitori di potenziale PPV8 (20pz.)","Potenzialverteiler PPV8 (20 Stk.)","Svorka na DIN lištu PPV8 (20 kusů)","Potentieel verdeler PPV8 (20 stuks)","not translated yet","not translated yet","not translated yet","not translated yet","not translated yet","not translated yet","not translated yet",null,null,null,null,null,195,165,265,195,195,5499,195,202.78,195,195,"Not done","Not done","Not done","Not done","Not done","Not done","Not done"]
[200169,"Rangierverteiler PRV8 (20 Stk.)",185,null,null,200169,"Push In Terminal Block 8x4 Seperated (20pcs)",157.5,null,null,200169,"Push In Terminal Block 8x4 Seperated (20pcs)",249,null,null,200169,"Bornier 8x4 Séparés (20pcs)",185,null,null,200169,"Borne para distribuidor de señales 8x4 PRV8",185,null,null,200169,"Propojovací rozvaděč PRV8 (20 kusů)",5199,null,null,200169,"Ripartitori di derivazione PRV8 (20pz.)",185,null,null,200169,"Rangierverteiler PRV8 (20 Stk.)",193.52,null,null,200169,"Propojovací rozvaděč PRV8 (20 kusů)",185,null,null,200169,"Patch verdeler PRV8 (20 stuks)",185,null,null,"Not done","not translated yet","Not done",null,null,"Not done","not translated yet","Not done",null,"Not done","not translated yet","Not done",null,null,"Not done","not translated yet","Not done",null,null,"Not done","not translated yet","Not done",null,null,"Not done","not translated yet","Not done",null,null,"Not done","not translated yet","Not done",null,null,null,null,null,null,null,null,118,200169,200169,200169,200169,200169,200169,200169,200169,200169,200169,"Not done","Not done","Not done","Not done","Not done","Not done","Not done",null,null,null,null,"Rangierverteiler PRV8 (20 Stk.)","Push In Terminal Block 8x4 Seperated (20pcs)","Push In Terminal Block 8x4 Seperated (20pcs)","Bornier 8x4 Séparés (20pcs)","Borne para distribuidor de señales 8x4 PRV8","Propojovací rozvaděč PRV8 (20 kusů)","Ripartitori di derivazione PRV8 (20pz.)","Rangierverteiler PRV8 (20 Stk.)","Propojovací rozvaděč PRV8 (20 kusů)","Patch verdeler PRV8 (20 stuks)","not translated yet","not translated yet","not translated yet","not translated yet","not translated yet","not translated yet","not translated yet",null,null,null,null,null,185,157.5,249,185,185,5199,185,193.52,185,185,"Not done","Not done","Not done","Not done","Not done","Not done","Not done"]
[200170,"Trennwand P-Reihe",10,null,null,200170,"Partition for 8x4 Terminals (10pcs)",8.5,null,null,200170,"Partition for 8x4 Terminals (10pcs)",14,null,null,200170,"Séparation pour bornier (10pcs)",10,null,null,200170,"Separador para bornes",10,null,null,200170,"Předělovací deska PRV8 (10 kusů)",299,null,null,200170,"Piastra di separazione P-serie (10pz.)",10,null,null,200170,"Trennwand P-Reihe",11.07,null,null,200170,"Předělovací deska PRV8 (10 kusů)",10,null,null,200170,"Scheidingsplaat P-serie (10 stuks)",10,null,null,"Not done","not translated yet","Not done",null,null,"Not done","not translated yet","Not done",null,"Not done","not translated yet","Not done",null,null,"Not done","not translated yet","Not done",null,null,"Not done","not translated yet","Not done",null,null,"Not done","not translated yet","Not done",null,null,"Not done","not translated yet","Not done",null,null,null,null,null,null,null,null,119,200170,200170,200170,200170,200170,200170,200170,200170,200170,200170,"Not done","Not done","Not done","Not done","Not done","Not done","Not done",null,null,null,null,"Trennwand P-Reihe","Partition for 8x4 Terminals (10pcs)","Partition for 8x4 Terminals (10pcs)","Séparation pour bornier (10pcs)","Separador para bornes","Předělovací deska PRV8 (10 kusů)","Piastra di separazione P-serie (10pz.)","Trennwand P-Reihe","Předělovací deska PRV8 (10 kusů)","Scheidingsplaat P-serie (10 stuks)","not translated yet","not translated yet","not translated yet","not translated yet","not translated yet","not translated yet","not translated yet",null,null,null,null,null,10,8.5,14,10,10,299,10,11.07,10,10,"Not done","Not done","Not done","Not done","Not done","Not done","Not done"]
[200171,"Bezeichnungsträger P-Reihe",25,null,null,200171,"Label Holder 8 Levels (20 pcs)",21.25,null,null,200171,"Label Holder 8 Levels (20 pcs)",34,null,null,200171,"Porte étiquette (8 niveaux) (20 pcs)",25,null,null,200171,"Soporte de señalización para bornes (8 pisos)",25,null,null,200171,"Držák na značky pro PPV8/PRV8 (20 kusů)",699,null,null,200171,"Supporto per siglatura P-serie (20pz.)",25,null,null,200171,"Bezeichnungsträger P-Reihe",26.81,null,null,200171,"Držák na značky pro PPV8/PRV8 (20 kusů)",25,null,null,200171,"Markering houder P-serie (20 stuks)",25,null,null,"Not done","not translated yet","Not done",null,null,"Not done","not translated yet","Not done",null,"Not done","not translated yet","Not done",null,null,"Not done","not translated yet","Not done",null,null,"Not done","not translated yet","Not done",null,null,"Not done","not translated yet","Not done",null,null,"Not done","not translated yet","Not done",null,null,null,null,null,null,null,null,120,200171,200171,200171,200171,200171,200171,200171,200171,200171,200171,"Not done","Not done","Not done","Not done","Not done","Not done","Not done",null,null,null,null,"Bezeichnungsträger P-Reihe","Label Holder 8 Levels (20 pcs)","Label Holder 8 Levels (20 pcs)","Porte étiquette (8 niveaux) (20 pcs)","Soporte de señalización para bornes (8 pisos)","Držák na značky pro PPV8/PRV8 (20 kusů)","Supporto per siglatura P-serie (20pz.)","Bezeichnungsträger P-Reihe","Držák na značky pro PPV8/PRV8 (20 kusů)","Markering houder P-serie (20 stuks)","not translated yet","not translated yet","not translated yet","not translated yet","not translated yet","not translated yet","not translated yet",null,null,null,null,null,25,21.25,34,25,25,699,25,26.81,25,25,"Not done","Not done","Not done","Not done","Not done","Not done","Not done"]
[200172,"Abschlussplatte P-Reihe",5,null,null,200172,"End Plate for 8x4 Terminals (10 pcs)",4.25,null,null,200172,"End Plate for 8x4 Terminals (10 pcs)",7,null,null,200172,"Plaque de fin pour bornier 8x4 (10 pcs)",5,null,null,200172,"Tapa final para borne 8x4",5,null,null,200172,"Bočnice pro PPV8/PRV8 (10 kusů)",139,null,null,200172,"Piastra terminale P-serie (10pz.)",5,null,null,200172,"Abschlussplatte P-Reihe",5.69,null,null,200172,"Bočnice pro PPV8/PRV8 (10 kusů)",5,null,null,200172,"Afsluitplaat P-serie (10 stuks)",5,null,null,"Not done","not translated yet","Not done",null,null,"Not done","not translated yet","Not done",null,"Not done","not translated yet","Not done",null,null,"Not done","not translated yet","Not done",null,null,"Not done","not translated yet","Not done",null,null,"Not done","not translated yet","Not done",null,null,"Not done","not translated yet","Not done",null,null,null,null,null,null,null,null,121,200172,200172,200172,200172,200172,200172,200172,200172,200172,200172,"Not done","Not done","Not done","Not done","Not done","Not done","Not done",null,null,null,null,"Abschlussplatte P-Reihe","End Plate for 8x4 Terminals (10 pcs)","End Plate for 8x4 Terminals (10 pcs)","Plaque de fin pour bornier 8x4 (10 pcs)","Tapa final para borne 8x4","Bočnice pro PPV8/PRV8 (10 kusů)","Piastra terminale P-serie (10pz.)","Abschlussplatte P-Reihe","Bočnice pro PPV8/PRV8 (10 kusů)","Afsluitplaat P-serie (10 stuks)","not translated yet","not translated yet","not translated yet","not translated yet","not translated yet","not translated yet","not translated yet",null,null,null,null,null,5,4.25,7,5,5,139,5,5.69,5,5,"Not done","Not done","Not done","Not done","Not done","Not done","Not done"]
[200173,"Jalousie Anschlussklemme PMAK4",190,null,null,200173,"Push In Terminal Block 3+Earth (50 pcs)",162.5,null,null,200173,"Push In Terminal Block 3+Earth (50 pcs)",259,null,null,200173,"Bornier 3 + terre PMAK4 (50 pcs)",190,null,null,200173,"Borne de 3 + tierra PMAK4",190,null,null,200173,"Svorka pro připojení motoru PMAK4 (50 kusů)",5299,null,null,200173,"Morsetto componibile colleg. motore PMAK4 (50pz.)",190,null,null,200173,"Jalousie Anschlussklemme PMAK4",193.52,null,null,200173,"Svorka pro připojení motoru PMAK4 (50 kusů)",190,null,null,200173,"motor aansluitklem PMAK4 (50 stuks)",190,null,null,"Not done","not translated yet","Not done",null,null,"Not done","not translated yet","Not done",null,"Not done","not translated yet","Not done",null,null,"Not done","not translated yet","Not done",null,null,"Not done","not translated yet","Not done",null,null,"Not done","not translated yet","Not done",null,null,"Not done","not translated yet","Not done",null,null,null,null,null,null,null,null,122,200173,200173,200173,200173,200173,200173,200173,200173,200173,200173,"Not done","Not done","Not done","Not done","Not done","Not done","Not done",null,null,null,null,"Jalousie Anschlussklemme PMAK4","Push In Terminal Block 3+Earth (50 pcs)","Push In Terminal Block 3+Earth (50 pcs)","Bornier 3 + terre PMAK4 (50 pcs)","Borne de 3 + tierra PMAK4","Svorka pro připojení motoru PMAK4 (50 kusů)","Morsetto componibile colleg. motore PMAK4 (50pz.)","Jalousie Anschlussklemme PMAK4","Svorka pro připojení motoru PMAK4 (50 kusů)","motor aansluitklem PMAK4 (50 stuks)","not translated yet","not translated yet","not translated yet","not translated yet","not translated yet","not translated yet","not translated yet",null,null,null,null,null,190,162.5,259,190,190,5299,190,193.52,190,190,"Not done","Not done","Not done","Not done","Not done","Not done","Not done"]
[200174,"Abschlussplatte PMAK4",10,null,null,200174,"End Plate for 3+Earth Terminals (20 pcs)",8.75,null,null,200174,"End Plate for 3+Earth Terminals (20 pcs)",14,null,null,200174,"Plaque de fin pour bornier 3 + terre PMAK4 (20 pcs)",10,null,null,200174,"Tapa final para borne de 3 + tierra PMAK4",10,null,null,200174,"Bočnice pro PMAK4 (20 kusů)",279,null,null,200174,"Piastra terminale PMAK4 (20pz.)",10,null,null,200174,"Abschlussplatte PMAK4",11.07,null,null,200174,"Bočnice pro PMAK4 (20 kusů)",10,null,null,200174,"Afsluitplaat PMAK4 (20 stuks)",10,null,null,"Not done","not translated yet","Not done",null,null,"Not done","not translated yet","Not done",null,"Not done","not translated yet","Not done",null,null,"Not done","not translated yet","Not done",null,null,"Not done","not translated yet","Not done",null,null,"Not done","not translated yet","Not done",null,null,"Not done","not translated yet","Not done",null,null,null,null,null,null,null,null,123,200174,200174,200174,200174,200174,200174,200174,200174,200174,200174,"Not done","Not done","Not done","Not done","Not done","Not done","Not done",null,null,null,null,"Abschlussplatte PMAK4","End Plate for 3+Earth Terminals (20 pcs)","End Plate for 3+Earth Terminals (20 pcs)","Plaque de fin pour bornier 3 + terre PMAK4 (20 pcs)","Tapa final para borne de 3 + tierra PMAK4","Bočnice pro PMAK4 (20 kusů)","Piastra terminale PMAK4 (20pz.)","Abschlussplatte PMAK4","Bočnice pro PMAK4 (20 kusů)","Afsluitplaat PMAK4 (20 stuks)","not translated yet","not translated yet","not translated yet","not translated yet","not translated yet","not translated yet","not translated yet",null,null,null,null,null,10,8.75,14,10,10,279,10,11.07,10,10,"Not done","Not done","Not done","Not done","Not done","Not done","Not done"]
[200175,"Installations-Reihenklemme PDL",100,null,null,200175,"Push In Terminal Block Twin+Earth (50 pcs)",85,null,null,200175,"Push In Terminal Block Twin+Earth (50 pcs)",141.5,null,null,200175,"Bornier 2 + Terre PDL (50 pcs)",100,null,null,200175,"Borne de 2 + tierra PDL",100,null,null,200175,"Svorkovnice PDL (50 kusů)",2799,null,null,200175,"Morsetto per installazione ai piani PDL (50pz.)",100,null,null,200175,"Installations-Reihenklemme PDL",110.19,null,null,200175,"Svorkovnice PDL (50 kusů)",100,null,null,200175,"Installatie klem PDL",100,null,null,"Not done","not translated yet","Not done",null,null,"Not done","not translated yet","Not done",null,"Not done","not translated yet","Not done",null,null,"Not done","not translated yet","Not done",null,null,"Not done","not translated yet","Not done",null,null,"Not done","not translated yet","Not done",null,null,"Not done","not translated yet","Not done",null,null,null,null,null,null,null,null,124,200175,200175,200175,200175,200175,200175,200175,200175,200175,200175,"Not done","Not done","Not done","Not done","Not done","Not done","Not done",null,null,null,null,"Installations-Reihenklemme PDL","Push In Terminal Block Twin+Earth (50 pcs)","Push In Terminal Block Twin+Earth (50 pcs)","Bornier 2 + Terre PDL (50 pcs)","Borne de 2 + tierra PDL","Svorkovnice PDL (50 kusů)","Morsetto per installazione ai piani PDL (50pz.)","Installations-Reihenklemme PDL","Svorkovnice PDL (50 kusů)","Installatie klem PDL","not translated yet","not translated yet","not translated yet","not translated yet","not translated yet","not translated yet","not translated yet",null,null,null,null,null,100,85,141.5,100,100,2799,100,110.19,100,100,"Not done","Not done","Not done","Not done","Not done","Not done","Not done"]
[200176,"Abschlussplatte PDL",7,null,null,200176,"End Plate for Twin+Earth Terminals (20 pcs)",6.25,null,null,200176,"End Plate for Twin+Earth Terminals (20 pcs)",10,null,null,200176,"Plaque de fin pour bornier 2 + terre PDL (20 pcs)",7,null,null,200176,"Tapa final para borne de 2 + tierra PDL",7,null,null,200176,"Bočnice pro PDL (20 kusů)",199,null,null,200176,"Piastra terminale PDL (20pz.)",7,null,null,200176,"Abschlussplatte PDL",8.19,null,null,200176,"Bočnice pro PDL (20 kusů)",7,null,null,200176,"Afsluitplaat PDL (20 stuks)",7,null,null,"Not done","not translated yet","Not done",null,null,"Not done","not translated yet","Not done",null,"Not done","not translated yet","Not done",null,null,"Not done","not translated yet","Not done",null,null,"Not done","not translated yet","Not done",null,null,"Not done","not translated yet","Not done",null,null,"Not done","not translated yet","Not done",null,null,null,null,null,null,null,null,125,200176,200176,200176,200176,200176,200176,200176,200176,200176,200176,"Not done","Not done","Not done","Not done","Not done","Not done","Not done",null,null,null,null,"Abschlussplatte PDL","End Plate for Twin+Earth Terminals (20 pcs)","End Plate for Twin+Earth Terminals (20 pcs)","Plaque de fin pour bornier 2 + terre PDL (20 pcs)","Tapa final para borne de 2 + tierra PDL","Bočnice pro PDL (20 kusů)","Piastra terminale PDL (20pz.)","Abschlussplatte PDL","Bočnice pro PDL (20 kusů)","Afsluitplaat PDL (20 stuks)","not translated yet","not translated yet","not translated yet","not translated yet","not translated yet","not translated yet","not translated yet",null,null,null,null,null,7,6.25,10,7,7,199,7,8.19,7,7,"Not done","Not done","Not done","Not done","Not done","Not done","Not done"]
[200177,"Endwinkel ZEW 35",7,null,null,200177,"End Bracket (20 pcs)",6.25,null,null,200177,"End Bracket (20 pcs)",10,null,null,200177,"Délimitateur de rail Din (20 pcs)",7,null,null,200177,"Ángulo de fijación lateral ZEW 35",7,null,null,200177,"Koncová podpěra svorkovnice ZEW 35 (20 kusů)",199,null,null,200177,"Terminale di fissaggio ZEW 35 (20pz.)",7,null,null,200177,"Endwinkel ZEW 35",8.19,null,null,200177,"Koncová podpěra svorkovnice ZEW 35 (20 kusů)",7,null,null,200177,"Eind klem ZEW (20 stuks)",7,null,null,"Not done","not translated yet","Not done",null,null,"Not done","not translated yet","Not done",null,"Not done","not translated yet","Not done",null,null,"Not done","not translated yet","Not done",null,null,"Not done","not translated yet","Not done",null,null,"Not done","not translated yet","Not done",null,null,"Not done","not translated yet","Not done",null,null,null,null,null,null,null,null,126,200177,200177,200177,200177,200177,200177,200177,200177,200177,200177,"Not done","Not done","Not done","Not done","Not done","Not done","Not done",null,null,null,null,"Endwinkel ZEW 35","End Bracket (20 pcs)","End Bracket (20 pcs)","Délimitateur de rail Din (20 pcs)","Ángulo de fijación lateral ZEW 35","Koncová podpěra svorkovnice ZEW 35 (20 kusů)","Terminale di fissaggio ZEW 35 (20pz.)","Endwinkel ZEW 35","Koncová podpěra svorkovnice ZEW 35 (20 kusů)","Eind klem ZEW (20 stuks)","not translated yet","not translated yet","not translated yet","not translated yet","not translated yet","not translated yet","not translated yet",null,null,null,null,null,7,6.25,10,7,7,199,7,8.19,7,7,"Not done","Not done","Not done","Not done","Not done","Not done","Not done"]
[200178,"Sicherungs-Reihenklemme",120,null,null,200178,"Push in Fused Terminal Block (25 pcs)",100,null,null,200178,"Push in Fused Terminal Block (25 pcs)",159,null,null,200178,"Bloc de terminal de fusible à connexion rapide (25 pcs)",120,null,null,200178,"Borne portafusibles",120,null,null,200178,"Pojistková svorkovnice (25 kusů)",3399,null,null,200178,"Morsetto componibile portafusibile (25pz.)",120,null,null,200178,"Sicherungs-Reihenklemme",119.44,null,null,200178,"Pojistková svorkovnice (25 kusů)",120,null,null,200178,"Zekering klem (25 stuks)",120,null,null,"Not done","not translated yet","Not done",null,null,"Not done","not translated yet","Not done",null,"Not done","not translated yet","Not done",null,null,"Not done","not translated yet","Not done",null,null,"Not done","not translated yet","Not done",null,null,"Not done","not translated yet","Not done",null,null,"Not done","not translated yet","Not done",null,null,null,null,null,null,null,null,127,200178,200178,200178,200178,200178,200178,200178,200178,200178,200178,"Not done","Not done","Not done","Not done","Not done","Not done","Not done",null,null,null,null,"Sicherungs-Reihenklemme","Push in Fused Terminal Block (25 pcs)","Push in Fused Terminal Block (25 pcs)","Bloc de terminal de fusible à connexion rapide (25 pcs)","Borne portafusibles","Pojistková svorkovnice (25 kusů)","Morsetto componibile portafusibile (25pz.)","Sicherungs-Reihenklemme","Pojistková svorkovnice (25 kusů)","Zekering klem (25 stuks)","not translated yet","not translated yet","not translated yet","not translated yet","not translated yet","not translated yet","not translated yet",null,null,null,null,null,120,100,159,120,120,3399,120,119.44,120,120,"Not done","Not done","Not done","Not done","Not done","Not done","Not done"]
[200179,"Abschlussplatte Sicherungskl.",16,null,null,200179,"End Plate For Fused Terminals (50 pcs)",13.5,null,null,200179,"End Plate For Fused Terminals (50 pcs)",22,null,null,200179,"Plaque de fin pour terminal de fusible (50 pcs)",16,null,null,200179,"Tapa final para borne portafusibles",16,null,null,200179,"Bočnice pojistkové svorkovnice (50 kusů)",449,null,null,200179,"Piastra terminale portafusibile (50pz.)",16,null,null,200179,"Abschlussplatte Sicherungskl.",16.62,null,null,200179,"Bočnice pojistkové svorkovnice (50 kusů)",16,null,null,200179,"Afsluitplaat zekering klem (50 pcs)",16,null,null,"Not done","not translated yet","Not done",null,null,"Not done","not translated yet","Not done",null,"Not done","not translated yet","Not done",null,null,"Not done","not translated yet","Not done",null,null,"Not done","not translated yet","Not done",null,null,"Not done","not translated yet","Not done",null,null,"Not done","not translated yet","Not done",null,null,null,null,null,null,null,null,128,200179,200179,200179,200179,200179,200179,200179,200179,200179,200179,"Not done","Not done","Not done","Not done","Not done","Not done","Not done",null,null,null,null,"Abschlussplatte Sicherungskl.","End Plate For Fused Terminals (50 pcs)","End Plate For Fused Terminals (50 pcs)","Plaque de fin pour terminal de fusible (50 pcs)","Tapa final para borne portafusibles","Bočnice pojistkové svorkovnice (50 kusů)","Piastra terminale portafusibile (50pz.)","Abschlussplatte Sicherungskl.","Bočnice pojistkové svorkovnice (50 kusů)","Afsluitplaat zekering klem (50 pcs)","not translated yet","not translated yet","not translated yet","not translated yet","not translated yet","not translated yet","not translated yet",null,null,null,null,null,16,13.5,22,16,16,449,16,16.62,16,16,"Not done","Not done","Not done","Not done","Not done","Not done","Not done"]
[200180,"Querverbinder 24 Polig (10 Stück)",60,null,null,200180,"Cross Connector For Fused Terminals (10 pcs)",50,null,null,200180,"Cross Connector For Fused Terminals (10 pcs)",79,null,null,200180,"Connecteur en croix pour terminal de fusible (10 pcs)",60,null,null,200180,"Conector transversal para borne portafusibles 24 Polig",60,null,null,200180,"24 pólová propojka (10 kusů)",1699,null,null,200180,"Collegamento trasversale 24 poli (10pz.)",60,null,null,200180,"Querverbinder 24 Polig (10 Stück)",64.77,null,null,200180,"24 pólová propojka (10 kusů)",60,null,null,200180,"Dwarsconnector 24 polig (10 pcs)",60,null,null,"Not done","not translated yet","Not done",null,null,"Not done","not translated yet","Not done",null,"Not done","not translated yet","Not done",null,null,"Not done","not translated yet","Not done",null,null,"Not done","not translated yet","Not done",null,null,"Not done","not translated yet","Not done",null,null,"Not done","not translated yet","Not done",null,null,null,null,null,null,null,null,129,200180,{"$f":"F132","v":200180},200180,200180,200180,200180,200180,200180,200180,200180,"Not done","Not done","Not done","Not done","Not done","Not done","Not done",null,null,null,null,"Querverbinder 24 Polig (10 Stück)","Cross Connector For Fused Terminals (10 pcs)","Cross Connector For Fused Terminals (10 pcs)","Connecteur en croix pour terminal de fusible (10 pcs)","Conector transversal para borne portafusibles 24 Polig","24 pólová propojka (10 kusů)","Collegamento trasversale 24 poli (10pz.)","Querverbinder 24 Polig (10 Stück)","24 pólová propojka (10 kusů)","Dwarsconnector 24 polig (10 pcs)","not translated yet","not translated yet","not translated yet","not translated yet","not translated yet","not translated yet","not translated yet",null,null,null,null,null,60,50,79,60,60,1699,60,64.77,60,60,"Not done","Not done","Not done","Not done","Not done","Not done","Not done"]
[200181,"Sicherung 2A",9,null,null,200181,"Blade Fuse 2A (100 pcs)",7.5,null,null,200181,"Blade Fuse 2A (100 pcs)",13,null,null,200181,"Fusible 2A (100 pcs)",9,null,null,200181,"Fusible 2A",9,null,null,200181,"Pojistky 2A (100 kusů)",249,null,null,200181,"Fusibile 2A (100pz.)",9,null,null,200181,"Sicherung 2A",9.82,null,null,200181,"Pojistky 2A (100 kusů)",9,null,null,200181,"Zekering 2A (100 pcs)",9,null,null,"Not done","not translated yet","Not done",null,null,"Not done","not translated yet","Not done",null,"Not done","not translated yet","Not done",null,null,"Not done","not translated yet","Not done",null,null,"Not done","not translated yet","Not done",null,null,"Not done","not translated yet","Not done",null,null,"Not done","not translated yet","Not done",null,null,null,null,null,null,null,null,130,{"$f":"A133","v":200181},200181,{"$f":"K133","v":200181},{"$f":"P133","v":200181},{"$f":"U133","v":200181},{"$f":"Z133","v":200181},{"$f":"AE133","v":200181},{"$f":"AJ133","v":200181},{"$f":"AO133","v":200181},{"$f":"AT133","v":200181},{"$f":"AY133","v":"Not done"},{"$f":"BD133","v":"Not done"},{"$f":"BH133","v":"Not done"},{"$f":"BM133","v":"Not done"},{"$f":"BR133","v":"Not done"},{"$f":"BW133","v":"Not done"},{"$f":"CB133","v":"Not done"},null,null,null,null,{"$f":"B133","v":"Sicherung 2A"},{"$f":"G133","v":"Blade Fuse 2A (100 pcs)"},{"$f":"L133","v":"Blade Fuse 2A (100 pcs)"},{"$f":"Q133","v":"Fusible 2A (100 pcs)"},{"$f":"V133","v":"Fusible 2A"},{"$f":"AA133","v":"Pojistky 2A (100 kusů)"},{"$f":"AF133","v":"Fusibile 2A (100pz.)"},{"$f":"AK133","v":"Sicherung 2A"},{"$f":"AP133","v":"Pojistky 2A (100 kusů)"},{"$f":"AU133","v":"Zekering 2A (100 pcs)"},{"$f":"AZ133","v":"not translated yet"},{"$f":"BE133","v":"not translated yet"},{"$f":"BI133","v":"not translated yet"},{"$f":"BN133","v":"not translated yet"},{"$f":"BS133","v":"not translated yet"},{"$f":"BX133","v":"not translated yet"},{"$f":"CC133","v":"not translated yet"},null,null,null,null,null,{"$f":"C133","v":9},{"$f":"H133","v":7.5},{"$f":"M133","v":13},{"$f":"R133","v":9},{"$f":"W133","v":9},{"$f":"AB133","v":249},{"$f":"AG133","v":9},{"$f":"AL133","v":9.82},{"$f":"AQ133","v":9},{"$f":"AV133","v":9},{"$f":"BA133","v":"Not done"},{"$f":"BF133","v":"Not done"},{"$f":"BJ133","v":"Not done"},{"$f":"BO133","v":"Not done"},{"$f":"BT133","v":"Not done"},{"$f":"BY133","v":"Not done"},{"$f":"CD133","v":"Not done"}]
[200183,"Sicherung 5A",9,null,null,200183,"Blade Fuse 5A (100 pcs)",7.5,null,null,200183,"Blade Fuse 5A (100 pcs)",13,null,null,200183,"Fusible 5A (100 pcs)",9,null,null,200183,"Fusible 5A",9,null,null,200183,"Pojistky 5A (100 kusů)",249,null,null,200183,"Fusibile 5A (100pz.)",9,null,null,200183,"Sicherung 5A",9.82,null,null,200183,"Pojistky 5A (100 kusů)",9,null,null,200183,"Zekering 5A (100 pcs)",9,null,null,"Not done","not translated yet","Not done",null,null,"Not done","not translated yet","Not done",null,"Not done","not translated yet","Not done",null,null,"Not done","not translated yet","Not done",null,null,"Not done","not translated yet","Not done",null,null,"Not done","not translated yet","Not done",null,null,"Not done","not translated yet","Not done",null,null,null,null,null,null,null,null,131,200183,200183,200183,200183,200183,200183,200183,200183,200183,200183,"Not done","Not done","Not done","Not done","Not done","Not done","Not done",null,null,null,null,"Sicherung 5A","Blade Fuse 5A (100 pcs)","Blade Fuse 5A (100 pcs)","Fusible 5A (100 pcs)","Fusible 5A","Pojistky 5A (100 kusů)","Fusibile 5A (100pz.)","Sicherung 5A","Pojistky 5A (100 kusů)","Zekering 5A (100 pcs)","not translated yet","not translated yet","not translated yet","not translated yet","not translated yet","not translated yet","not translated yet",null,null,null,null,null,9,7.5,13,9,9,249,9,9.82,9,9,"Not done","Not done","Not done","Not done","Not done","Not done","Not done"]
[200184,"Sicherung 10A",9,null,null,200184,"Blade Fuse 10A (100 pcs)",7.5,null,null,200184,"Blade Fuse 10A (100 pcs)",13,null,null,200184,"Fusible 10A (100 pcs)",9,null,null,200184,"Fusible 10A",9,null,null,200184,"Pojistky 10A (100 kusů)",249,null,null,200184,"Fusibile 10A (100pz.)",9,null,null,200184,"Sicherung 10A",9.82,null,null,200184,"Pojistky 10A (100 kusů)",9,null,null,200184,"Zekering 10A (100 pcs)",9,null,null,"Not done","not translated yet","Not done",null,null,"Not done","not translated yet","Not done",null,"Not done","not translated yet","Not done",null,null,"Not done","not translated yet","Not done",null,null,"Not done","not translated yet","Not done",null,null,"Not done","not translated yet","Not done",null,null,"Not done","not translated yet","Not done",null,null,null,null,null,null,null,null,132,200184,200184,200184,200184,200184,200184,200184,200184,200184,200184,"Not done","Not done","Not done","Not done","Not done","Not done","Not done",null,null,null,null,"Sicherung 10A","Blade Fuse 10A (100 pcs)","Blade Fuse 10A (100 pcs)","Fusible 10A (100 pcs)","Fusible 10A","Pojistky 10A (100 kusů)","Fusibile 10A (100pz.)","Sicherung 10A","Pojistky 10A (100 kusů)","Zekering 10A (100 pcs)","not translated yet","not translated yet","not translated yet","not translated yet","not translated yet","not translated yet","not translated yet",null,null,null,null,null,9,7.5,13,9,9,249,9,9.82,9,9,"Not done","Not done","Not done","Not done","Not done","Not done","Not done"]
[200186,"Loxone Folder Set",3,null,null,200186,"Loxone Brochure (25 pcs)",0.5,null,null,200186,"Loxone Brochure (25 pcs)",5,null,null,200186,"Loxone Brochure (25 pcs)",3,null,null,200186,"Catálogo Loxone",3,null,null,200193,"Loxone brožurka - 25 kusů",85,null,null,200186,"Loxone Folder Set",3,null,null,200201,"Loxone Folder Set",4.58,null,null,200193,"Loxone brožurka - 25 kusů",3,null,null,200292,"Loxone Brochure NL (25 pcs)",3,null,null,"Not done","not translated yet","Not done",null,null,"Not done","not translated yet","Not done",null,"Not done","not translated yet","Not done",null,null,"Not done","not translated yet","Not done",null,null,"Not done","not translated yet","Not done",null,null,"Not done","not translated yet","Not done",null,null,"Not done","not translated yet","Not done",null,null,null,null,null,null,null,null,133,200186,200186,200186,200186,200186,200193,200186,200201,200193,200292,"Not done","Not done","Not done","Not done","Not done","Not done","Not done",null,null,null,null,"Loxone Folder Set","Loxone Brochure (25 pcs)","Loxone Brochure (25 pcs)","Loxone Brochure (25 pcs)","Catálogo Loxone","Loxone brožurka - 25 kusů","Loxone Folder Set","Loxone Folder Set","Loxone brožurka - 25 kusů","Loxone Brochure NL (25 pcs)","not translated yet","not translated yet","not translated yet","not translated yet","not translated yet","not translated yet","not translated yet",null,null,null,null,null,3,0.5,5,3,3,85,3,4.58,3,3,"Not done","Not done","Not done","Not done","Not done","Not done","Not done"]
[200191,"Elektr.Schlüssel Leser Outdoor",28,null,null,200191,"iButton Reader 1-Wire Outdoor",23.75,null,null,200191,"iButton Reader 1-Wire Outdoor",38,null,null,200191,"Lecteur iButton extérieur",28,null,null,200191,"Lector de llaves iReader exterior",28,null,null,200191,"čtečka elektronického klíče - nerez",779,null,null,200191,"Lettore chiave elettronica outdoor",28,null,null,200191,"Elektr.Schlüssel Leser Outdoor",33.29,null,null,200191,"čtečka elektronického klíče - nerez",28,null,null,200191,"iButton Elec. Sleutel 1-Wire Outdoor",28,null,null,"Not done","not translated yet","Not done",null,null,"Not done","not translated yet","Not done",null,"Not done","not translated yet","Not done",null,null,"Not done","not translated yet","Not done",null,null,"Not done","not translated yet","Not done",null,null,"Not done","not translated yet","Not done",null,null,"Not done","not translated yet","Not done",null,null,null,null,null,null,null,null,134,200191,200191,200191,200191,200191,200191,200191,200191,200191,200191,"Not done","Not done","Not done","Not done","Not done","Not done","Not done",null,null,null,null,"Elektr.Schlüssel Leser Outdoor","iButton Reader 1-Wire Outdoor","iButton Reader 1-Wire Outdoor","Lecteur iButton extérieur","Lector de llaves iReader exterior","čtečka elektronického klíče - nerez","Lettore chiave elettronica outdoor","Elektr.Schlüssel Leser Outdoor","čtečka elektronického klíče - nerez","iButton Elec. Sleutel 1-Wire Outdoor","not translated yet","not translated yet","not translated yet","not translated yet","not translated yet","not translated yet","not translated yet",null,null,null,null,null,28,23.75,38,28,28,779,28,33.29,28,28,"Not done","Not done","Not done","Not done","Not done","Not done","Not done"]
[200207,"KEBA KeContakt P20 Wallbox",960,null,null,200207,"Keba KeContact P20 Wallbox",812.5,null,null,"not available in this country","not available in this country",0,null,null,200207,"Keba KeContact P20 Wallbox",960,null,null,200207,"KEBA KeContakt P20 Wallbox",960,null,null,200207,"Keba KeContact P20 Wallbox",22999,null,null,200207,"KEBA KeContakt P20 Wallbox",960,null,null,200207,"KEBA KeContakt P20 Wallbox",1063.8900000000001,null,null,200207,"Keba KeContact P20 Wallbox",960,null,null,200207,"Keba KeContact P20 Wallbox",960,null,null,"Not done","not translated yet","Not done",null,null,"Not done","not translated yet","Not done",null,"Not done","not translated yet","Not done",null,null,"Not done","not translated yet","Not done",null,null,"Not done","not translated yet","Not done",null,null,"Not done","not translated yet","Not done",null,null,"Not done","not translated yet","Not done",null,null,null,null,null,null,null,null,135,200207,200207,"not available in this country",200207,200207,200207,200207,200207,200207,200207,"Not done","Not done","Not done","Not done","Not done","Not done","Not done",null,null,null,null,"KEBA KeContakt P20 Wallbox","Keba KeContact P20 Wallbox","not available in this country","Keba KeContact P20 Wallbox","KEBA KeContakt P20 Wallbox","Keba KeContact P20 Wallbox","KEBA KeContakt P20 Wallbox","KEBA KeContakt P20 Wallbox","Keba KeContact P20 Wallbox","Keba KeContact P20 Wallbox","not translated yet","not translated yet","not translated yet","not translated yet","not translated yet","not translated yet","not translated yet",null,null,null,null,null,960,812.5,0,960,960,22999,960,1063.8900000000001,960,960,"Not done","Not done","Not done","Not done","Not done","Not done","Not done"]
[200202,"Loxone Speaker Einbaubox abgehängte Decken",36,null,null,200202,"Loxone Speaker Back Box For Suspended Ceilings",30,null,null,200202,"Loxone Speaker Back Box For Suspended Ceilings",39,null,null,200202,"Loxone Speaker Back Box pour faux plafond",36,null,null,200202,"Caja de empotrar falso techo Loxone Speaker",36,null,null,200202,"Loxone Speaker back box pro snížené stropy",999,null,null,200202,"Loxone Speaker box incasso controsoffitti",36,null,null,200202,"Loxone Speaker Einbaubox abgehängte Decken",46.25,null,null,200202,"Loxone Speaker back box pro snížené stropy",36,null,null,200202,"Loxone Speaker Inbouwdoos voor vals plafond",36,null,null,"Not done","not translated yet","Not done",null,null,"Not done","not translated yet","Not done",null,"Not done","not translated yet","Not done",null,null,"Not done","not translated yet","Not done",null,null,"Not done","not translated yet","Not done",null,null,"Not done","not translated yet","Not done",null,null,"Not done","not translated yet","Not done",null,null,null,null,null,null,null,null,136,200202,200202,200202,200202,200202,200202,200202,200202,200202,200202,"Not done","Not done","Not done","Not done","Not done","Not done","Not done",null,null,null,null,"Loxone Speaker Einbaubox abgehängte Decken","Loxone Speaker Back Box For Suspended Ceilings","Loxone Speaker Back Box For Suspended Ceilings","Loxone Speaker Back Box pour faux plafond","Caja de empotrar falso techo Loxone Speaker","Loxone Speaker back box pro snížené stropy","Loxone Speaker box incasso controsoffitti","Loxone Speaker Einbaubox abgehängte Decken","Loxone Speaker back box pro snížené stropy","Loxone Speaker Inbouwdoos voor vals plafond","not translated yet","not translated yet","not translated yet","not translated yet","not translated yet","not translated yet","not translated yet",null,null,null,null,null,36,30,39,36,36,999,36,46.25,36,36,"Not done","Not done","Not done","Not done","Not done","Not done","Not done"]
[200280,"LED Streifen Zubehör-Set RGBW",17,null,null,200280,"LED Strip Accessories Set - RGBW",14,null,null,200280,"LED Strip Accessories Set - RGBW",19,null,null,200280,"Kit accessoires Ruban Led RGBW",17,null,null,200280,"Kit de accesorios para tiras LED RGBW",17,null,null,200280,"Příslušenství k LED páskům - set RGBW",449,null,null,200280,"Strisce LED set accessorio RGBW",17,null,null,200280,"LED Streifen Zubehör-Set RGBW",21.25,null,null,200280,"Příslušenství k LED páskům - set RGBW",17,null,null,200280,"LED Strip toebehoren Set - RGBW",17,null,null,"Not done","not translated yet","Not done",null,null,"Not done","not translated yet","Not done",null,"Not done","not translated yet","Not done",null,null,"Not done","not translated yet","Not done",null,null,"Not done","not translated yet","Not done",null,null,"Not done","not translated yet","Not done",null,null,"Not done","not translated yet","Not done",null,null,null,null,null,null,null,null,137,200280,200280,200280,200280,200280,200280,200280,200280,200280,200280,"Not done","Not done","Not done","Not done","Not done","Not done","Not done",null,null,null,null,"LED Streifen Zubehör-Set RGBW","LED Strip Accessories Set - RGBW","LED Strip Accessories Set - RGBW","Kit accessoires Ruban Led RGBW","Kit de accesorios para tiras LED RGBW","Příslušenství k LED páskům - set RGBW","Strisce LED set accessorio RGBW","LED Streifen Zubehör-Set RGBW","Příslušenství k LED páskům - set RGBW","LED Strip toebehoren Set - RGBW","not translated yet","not translated yet","not translated yet","not translated yet","not translated yet","not translated yet","not translated yet",null,null,null,null,null,17,14,19,17,17,449,17,21.25,17,17,"Not done","Not done","Not done","Not done","Not done","Not done","Not done"]
[200278,"LED Streifen Zubehör-Set WW",12,null,null,200278,"LED Strip Accessories Set - Warm White",10,null,null,200278,"LED Strip Accessories Set - Warm White",14,null,null,200278,"Kit accessoires Ruban Led blanc",12,null,null,200278,"Kit de accesorios para tiras LED WW",12,null,null,200278,"Příslušenství k LED páskům - set WW",325,null,null,200278,"Strisce LED set accessorio WW",12,null,null,200278,"LED Streifen Zubehör-Set WW",14.77,null,null,200278,"Příslušenství k LED páskům - set WW",12,null,null,200278,"LED Strip toebehoren Set - Warm Wit",12,null,null,"Not done","not translated yet","Not done",null,null,"Not done","not translated yet","Not done",null,"Not done","not translated yet","Not done",null,null,"Not done","not translated yet","Not done",null,null,"Not done","not translated yet","Not done",null,null,"Not done","not translated yet","Not done",null,null,"Not done","not translated yet","Not done",null,null,null,null,null,null,null,null,138,200278,200278,200278,200278,200278,200278,200278,200278,200278,200278,"Not done","Not done","Not done","Not done","Not done","Not done","Not done",null,null,null,null,"LED Streifen Zubehör-Set WW","LED Strip Accessories Set - Warm White","LED Strip Accessories Set - Warm White","Kit accessoires Ruban Led blanc","Kit de accesorios para tiras LED WW","Příslušenství k LED páskům - set WW","Strisce LED set accessorio WW","LED Streifen Zubehör-Set WW","Příslušenství k LED páskům - set WW","LED Strip toebehoren Set - Warm Wit","not translated yet","not translated yet","not translated yet","not translated yet","not translated yet","not translated yet","not translated yet",null,null,null,null,null,12,10,14,12,12,325,12,14.77,12,12,"Not done","Not done","Not done","Not done","Not done","Not done","Not done"]
[200161,"Steckernetzteil 24V, 6,25A",65,null,null,200161,"Power Adapter 24V 6.25A",57.5,null,null,200161,"Power Adapter 24V 6.25A",84.9,null,null,200161,"Alimentation transfo 24V 6.25A",65,null,null,200161,"Fuente de alimentación 24V, 6,25A",65,null,null,200161,"Napájecí zdroj do zásuvky 24V, 6,25A Typ E,F",1799,null,null,200161,"Alimentatore a presa 24V 6,25A",65,null,null,200286,"Steckernetzteil 24V, 6,25A",83.29,null,null,200161,"Napájecí zdroj do zásuvky 24V, 6,25A Typ E,F",65,null,null,200161,"Voeding 24V 6.25A",65,null,null,"Not done","not translated yet","Not done",null,null,"Not done","not translated yet","Not done",null,"Not done","not translated yet","Not done",null,null,"Not done","not translated yet","Not done",null,null,"Not done","not translated yet","Not done",null,null,"Not done","not translated yet","Not done",null,null,"Not done","not translated yet","Not done",null,null,null,null,null,null,null,null,139,200161,200161,200161,200161,200161,200161,200161,200286,200161,200161,"Not done","Not done","Not done","Not done","Not done","Not done","Not done",null,null,null,null,"Steckernetzteil 24V, 6,25A","Power Adapter 24V 6.25A","Power Adapter 24V 6.25A","Alimentation transfo 24V 6.25A","Fuente de alimentación 24V, 6,25A","Napájecí zdroj do zásuvky 24V, 6,25A Typ E,F","Alimentatore a presa 24V 6,25A","Steckernetzteil 24V, 6,25A","Napájecí zdroj do zásuvky 24V, 6,25A Typ E,F","Voeding 24V 6.25A","not translated yet","not translated yet","not translated yet","not translated yet","not translated yet","not translated yet","not translated yet",null,null,null,null,null,65,57.5,84.9,65,65,1799,65,83.29,65,65,"Not done","Not done","Not done","Not done","Not done","Not done","Not done"]
[100205,"Loxone Music Server Upgrade",99,null,null,100205,"Loxone Music Server Upgrade",80,null,null,100205,"Loxone Music Server Upgrade",140.09,null,null,100205,"Loxone Music Server Mise à niveau",99,null,null,100205,"Actualización Loxone Music Server",99,null,null,100205,"Loxone Music Server Upgrade",2699,null,null,100205,"Loxone Music Server Upgrade",99,null,null,100205,"Loxone Music Server Upgrade",119.44,null,null,100205,"Loxone Music Server Upgrade",99,null,null,100205,"Loxone Music Server Upgrade",99,null,null,"Not done","not translated yet","Not done",null,null,"Not done","not translated yet","Not done",null,"Not done","not translated yet","Not done",null,null,"Not done","not translated yet","Not done",null,null,"Not done","not translated yet","Not done",null,null,"Not done","not translated yet","Not done",null,null,"Not done","not translated yet","Not done",null,null,null,null,null,null,null,null,140,100205,100205,100205,100205,100205,100205,100205,100205,100205,100205,"Not done","Not done","Not done","Not done","Not done","Not done","Not done",null,null,null,null,"Loxone Music Server Upgrade","Loxone Music Server Upgrade","Loxone Music Server Upgrade","Loxone Music Server Mise à niveau","Actualización Loxone Music Server","Loxone Music Server Upgrade","Loxone Music Server Upgrade","Loxone Music Server Upgrade","Loxone Music Server Upgrade","Loxone Music Server Upgrade","not translated yet","not translated yet","not translated yet","not translated yet","not translated yet","not translated yet","not translated yet",null,null,null,null,null,99,80,140.09,99,99,2699,99,119.44,99,99,"Not done","Not done","Not done","Not done","Not done","Not done","Not done"]
[200273,"Loxone Intercom XL",1150,null,null,200274,"Loxone Intercom XL",975,null,null,200274,"Loxone Intercom XL",1269,null,null,200274,"Intercom XL",1150,null,null,200273,"Loxone Intercom XL",1150,null,null,200273,"Loxone Intercom XL",31499,null,null,200273,"Loxone Intercom XL",1150,null,null,200192,"Loxone Intercom XL",1480.56,null,null,200273,"Loxone Intercom XL",1150,null,null,200273,"Loxone Intercom XL",1150,null,null,"Not done","not translated yet","Not done",null,null,"Not done","not translated yet","Not done",null,"Not done","not translated yet","Not done",null,null,"Not done","not translated yet","Not done",null,null,"Not done","not translated yet","Not done",null,null,"Not done","not translated yet","Not done",null,null,"Not done","not translated yet","Not done",null,null,null,null,null,null,null,null,141,200273,200274,200274,200274,200273,200273,200273,200192,200273,200273,"Not done","Not done","Not done","Not done","Not done","Not done","Not done",null,null,null,null,"Loxone Intercom XL","Loxone Intercom XL","Loxone Intercom XL","Intercom XL","Loxone Intercom XL","Loxone Intercom XL","Loxone Intercom XL","Loxone Intercom XL","Loxone Intercom XL","Loxone Intercom XL","not translated yet","not translated yet","not translated yet","not translated yet","not translated yet","not translated yet","not translated yet",null,null,null,null,null,1150,975,1269,1150,1150,31499,1150,1480.56,1150,1150,"Not done","Not done","Not done","Not done","Not done","Not done","Not done"]
[100190,"Bewegungsmelder Air weiß",83.25,null,null,100190,"Motion Sensor Air white",64.8,null,null,100190,"Motion Sensor Air white",95,null,null,100190,"Détecteur de présence Air blanc",83.25,null,null,100190,"Detector de movimiento Air blanco",83.25,null,null,100190,"Pohybový senzor Air",2249,null,null,100190,"Sensore di movimento Air bianco",83.25,null,null,100190,"Bewegungsmelder Air",100.93,null,null,100190,"Pohybový senzor Air",83.25,null,null,100190,"Bewegingsmelder Air",83.25,null,null,"Not done","not translated yet","Not done",null,null,"Not done","not translated yet","Not done",null,"Not done","not translated yet","Not done",null,null,"Not done","not translated yet","Not done",null,null,"Not done","not translated yet","Not done",null,null,"Not done","not translated yet","Not done",null,null,"Not done","not translated yet","Not done",null,null,null,null,null,null,null,null,142,100190,100190,100190,100190,100190,100190,100190,100190,100190,100190,"Not done","Not done","Not done","Not done","Not done","Not done","Not done",null,null,null,null,"Bewegungsmelder Air weiß","Motion Sensor Air white","Motion Sensor Air white","Détecteur de présence Air blanc","Detector de movimiento Air blanco","Pohybový senzor Air","Sensore di movimento Air bianco","Bewegungsmelder Air","Pohybový senzor Air","Bewegingsmelder Air","not translated yet","not translated yet","not translated yet","not translated yet","not translated yet","not translated yet","not translated yet",null,null,null,null,null,83.25,64.8,95,83.25,83.25,2249,83.25,100.93,83.25,83.25,"Not done","Not done","Not done","Not done","Not done","Not done","Not done"]
[200281,"NFC Smart Tags (25 Stk.)",23,null,null,200281,"NFC Smart Tags",18.75,null,null,200281,"NFC Smart Tags",26,null,null,200281,"NFC Smart Tags",23,null,null,200281,"NFC Smart Tags",23,null,null,200281,"NFC Smart tagy",629,null,null,200281,"NFC Smart Tags (25 pz.)",23,null,null,200281,"NFC Smart Tags (25 Stk.)",29.58,null,null,200281,"NFC Smart tagy",23,null,null,200281,"NFC Smart Tags",23,null,null,"Not done","not translated yet","Not done",null,null,"Not done","not translated yet","Not done",null,"Not done","not translated yet","Not done",null,null,"Not done","not translated yet","Not done",null,null,"Not done","not translated yet","Not done",null,null,"Not done","not translated yet","Not done",null,null,"Not done","not translated yet","Not done",null,null,null,null,null,null,null,null,143,200281,200281,200281,200281,200281,200281,200281,200281,200281,200281,"Not done","Not done","Not done","Not done","Not done","Not done","Not done",null,null,null,null,"NFC Smart Tags (25 Stk.)","NFC Smart Tags","NFC Smart Tags","NFC Smart Tags","NFC Smart Tags","NFC Smart tagy","NFC Smart Tags (25 pz.)","NFC Smart Tags (25 Stk.)","NFC Smart tagy","NFC Smart Tags","not translated yet","not translated yet","not translated yet","not translated yet","not translated yet","not translated yet","not translated yet",null,null,null,null,null,23,18.75,26,23,23,629,23,29.58,23,23,"Not done","Not done","Not done","Not done","Not done","Not done","Not done"]
[100204,"LED Spot RGBW",49.92,null,null,100204,"LED Spot RGBW",37.5,null,null,100204,"LED Spot RGBW",55,null,null,100204,"Spot Led RGBW",49.92,null,null,100204,"Led Spot RGBW",49.92,null,null,100204,"LED Spot RGBW",1349,null,null,100204,"LED Spot RGBW",49.92,null,null,100204,"LED Spot RGBW",60.14,null,null,100204,"LED Spot RGBW",49.92,null,null,100204,"LED Spot RGBW",49.92,null,null,"Not done","not translated yet","Not done",null,null,"Not done","not translated yet","Not done",null,"Not done","not translated yet","Not done",null,null,"Not done","not translated yet","Not done",null,null,"Not done","not translated yet","Not done",null,null,"Not done","not translated yet","Not done",null,null,"Not done","not translated yet","Not done",null,null,null,null,null,null,null,null,144,100204,100204,100204,100204,100204,100204,100204,100204,100204,100204,"Not done","Not done","Not done","Not done","Not done","Not done","Not done",null,null,null,null,"LED Spot RGBW","LED Spot RGBW","LED Spot RGBW","Spot Led RGBW","Led Spot RGBW","LED Spot RGBW","LED Spot RGBW","LED Spot RGBW","LED Spot RGBW","LED Spot RGBW","not translated yet","not translated yet","not translated yet","not translated yet","not translated yet","not translated yet","not translated yet",null,null,null,null,null,49.92,37.5,55,49.92,49.92,1349,49.92,60.14,49.92,49.92,"Not done","Not done","Not done","Not done","Not done","Not done","Not done"]
[100203,"LED Spot WW",33.25,null,null,100203,"LED Spot Warm White",25,null,null,100203,"LED Spot Warm White",39,null,null,100203,"Spot Led blanc chaud",33.25,null,null,100203,"Led Spot WW",33.25,null,null,100203,"LED Spot WW",899,null,null,100203,"LED Spot WW",33.25,null,null,100203,"LED Spot WW",40.69,null,null,100203,"LED Spot WW",33.25,null,null,100203,"LED Spot Warm Wit",33.25,null,null,"Not done","not translated yet","Not done",null,null,"Not done","not translated yet","Not done",null,"Not done","not translated yet","Not done",null,null,"Not done","not translated yet","Not done",null,null,"Not done","not translated yet","Not done",null,null,"Not done","not translated yet","Not done",null,null,"Not done","not translated yet","Not done",null,null,null,null,null,null,null,null,145,100203,100203,100203,100203,100203,100203,100203,100203,100203,100203,"Not done","Not done","Not done","Not done","Not done","Not done","Not done",null,null,null,null,"LED Spot WW","LED Spot Warm White","LED Spot Warm White","Spot Led blanc chaud","Led Spot WW","LED Spot WW","LED Spot WW","LED Spot WW","LED Spot WW","LED Spot Warm Wit","not translated yet","not translated yet","not translated yet","not translated yet","not translated yet","not translated yet","not translated yet",null,null,null,null,null,33.25,25,39,33.25,33.25,899,33.25,40.69,33.25,33.25,"Not done","Not done","Not done","Not done","Not done","Not done","Not done"]
[200294,"Elektroauto Ladebkabel Typ 2",319,null,null,200294,"Electric Car Charging Cable Type 2",252,null,null,"not available in this country","not available in this country",0,null,null,200294,"Câble de recharge pour voiture électriques Type 2",319,null,null,200294,"Cable de carga del coche eléctrico Tipo 2",319,null,null,200294,"Nabíjecí kabel typ 2",8599,null,null,200294,"Cavo di carico auto elettrica tipo 2",319,null,null,200294,"Elektroauto Ladebkabel Typ 2",387.96,null,null,200294,"Nabíjecí kabel typ 2",319,null,null,200294,"Electrische auto laadkabel Type 2",319,null,null,"Not done","not translated yet","Not done",null,null,"Not done","not translated yet","Not done",null,"Not done","not translated yet","Not done",null,null,"Not done","not translated yet","Not done",null,null,"Not done","not translated yet","Not done",null,null,"Not done","not translated yet","Not done",null,null,"Not done","not translated yet","Not done",null,null,null,null,null,null,null,null,146,200294,200294,"not available in this country",200294,200294,200294,200294,200294,200294,200294,"Not done","Not done","Not done","Not done","Not done","Not done","Not done",null,null,null,null,"Elektroauto Ladebkabel Typ 2","Electric Car Charging Cable Type 2","not available in this country","Câble de recharge pour voiture électriques Type 2","Cable de carga del coche eléctrico Tipo 2","Nabíjecí kabel typ 2","Cavo di carico auto elettrica tipo 2","Elektroauto Ladebkabel Typ 2","Nabíjecí kabel typ 2","Electrische auto laadkabel Type 2","not translated yet","not translated yet","not translated yet","not translated yet","not translated yet","not translated yet","not translated yet",null,null,null,null,null,319,252,0,319,319,8599,319,387.96,319,319,"Not done","Not done","Not done","Not done","Not done","Not done","Not done"]
[100218,"Tree Extension",82.5,null,null,100218,"Tree Extension",72.5,null,null,100218,"Tree Extension",99,null,null,100218,"Extension Tree",82.5,null,null,100218,"Tree Extension",82.5,null,null,100218,"Tree Extension",2099,null,null,100218,"Tree Extension",82.5,null,null,100218,"Tree Extension",110.19,null,null,100218,"Tree Extension",82.5,null,null,100218,"Tree Extension",82.5,null,null,"Not done","not translated yet","Not done",null,null,"Not done","not translated yet","Not done",null,"Not done","not translated yet","Not done",null,null,"Not done","not translated yet","Not done",null,null,"Not done","not translated yet","Not done",null,null,"Not done","not translated yet","Not done",null,null,"Not done","not translated yet","Not done",null,null,null,null,null,null,null,null,147,100218,100218,100218,100218,100218,100218,100218,100218,100218,100218,"Not done","Not done","Not done","Not done","Not done","Not done","Not done",null,null,null,null,"Tree Extension","Tree Extension","Tree Extension","Extension Tree","Tree Extension","Tree Extension","Tree Extension","Tree Extension","Tree Extension","Tree Extension","not translated yet","not translated yet","not translated yet","not translated yet","not translated yet","not translated yet","not translated yet",null,null,null,null,null,82.5,72.5,99,82.5,82.5,2099,82.5,110.19,82.5,82.5,"Not done","Not done","Not done","Not done","Not done","Not done","Not done"]
[100221,"Touch Tree Weiß",69,null,null,100221,"Touch Tree White",57.5,null,null,100221,"Touch Tree White",79,null,null,100221,"Touch Tree Blanc",69,null,null,100221,"Touch Tree Blanco",69,null,null,100221,"Touch Tree bílá",1849,null,null,100221,"Touch Tree bianco",69,null,null,100221,"Touch Tree Weiß",89.77,null,null,100221,"Touch Tree bílá",64.5,null,null,100221,"Touch Tree Wit",69,null,null,"Not done","not translated yet","Not done",null,null,"Not done","not translated yet","Not done",null,"Not done","not translated yet","Not done",null,null,"Not done","not translated yet","Not done",null,null,"Not done","not translated yet","Not done",null,null,"Not done","not translated yet","Not done",null,null,"Not done","not translated yet","Not done",null,null,null,null,null,null,null,null,148,100221,100221,100221,100221,100221,100221,100221,100221,100221,100221,"Not done","Not done","Not done","Not done","Not done","Not done","Not done",null,null,null,null,"Touch Tree Weiß","Touch Tree White","Touch Tree White","Touch Tree Blanc","Touch Tree Blanco","Touch Tree bílá","Touch Tree bianco","Touch Tree Weiß","Touch Tree bílá","Touch Tree Wit","not translated yet","not translated yet","not translated yet","not translated yet","not translated yet","not translated yet","not translated yet",null,null,null,null,null,69,57.5,79,69,69,1849,69,89.77,64.5,69,"Not done","Not done","Not done","Not done","Not done","Not done","Not done"]
[100222,"Touch Tree Anthrazit",69,null,null,100222,"Touch Tree Anthracite",57.5,null,null,100222,"Touch Tree Black",79,null,null,100222,"Touch Tree Anthracite",69,null,null,100222,"Touch Tree Antracita",69,null,null,100222,"Touch Tree anthrazit",1849,null,null,100222,"Touch Tree antracite",69,null,null,100222,"Touch Tree Anthrazit",89.77,null,null,100222,"Touch Tree anthrazit",64.5,null,null,100222,"Touch Tree Anthraciet",69,null,null,"Not done","not translated yet","Not done",null,null,"Not done","not translated yet","Not done",null,"Not done","not translated yet","Not done",null,null,"Not done","not translated yet","Not done",null,null,"Not done","not translated yet","Not done",null,null,"Not done","not translated yet","Not done",null,null,"Not done","not translated yet","Not done",null,null,null,null,null,null,null,null,149,100222,100222,100222,100222,100222,100222,100222,100222,100222,100222,"Not done","Not done","Not done","Not done","Not done","Not done","Not done",null,null,null,null,"Touch Tree Anthrazit","Touch Tree Anthracite","Touch Tree Black","Touch Tree Anthracite","Touch Tree Antracita","Touch Tree anthrazit","Touch Tree antracite","Touch Tree Anthrazit","Touch Tree anthrazit","Touch Tree Anthraciet","not translated yet","not translated yet","not translated yet","not translated yet","not translated yet","not translated yet","not translated yet",null,null,null,null,null,69,57.5,79,69,69,1849,69,89.77,64.5,69,"Not done","Not done","Not done","Not done","Not done","Not done","Not done"]
[100223,"Bewegungsmelder Tree Weiß",74.5,null,null,100223,"Motion Sensor Tree White",60,null,null,100223,"Motion Sensor Tree White",86,null,null,100223,"Détecteur de mouvement Tree blanc",74.5,null,null,100223,"Detector de movimiento Tree",74.5,null,null,100223,"Motion Sensor Tree bilá",1999,null,null,100223,"Sensore di movimento Tree bianco",74.5,null,null,100223,"Bewegungsmelder Tree Weiß",92.55,null,null,100223,"Motion Sensor Tree bilá",74.5,null,null,100223,"Bewegingsmelder Tree",74.5,null,null,"Not done","not translated yet","Not done",null,null,"Not done","not translated yet","Not done",null,"Not done","not translated yet","Not done",null,null,"Not done","not translated yet","Not done",null,null,"Not done","not translated yet","Not done",null,null,"Not done","not translated yet","Not done",null,null,"Not done","not translated yet","Not done",null,null,null,null,null,null,null,null,150,100223,100223,100223,100223,100223,100223,100223,100223,100223,100223,"Not done","Not done","Not done","Not done","Not done","Not done","Not done",null,null,null,null,"Bewegungsmelder Tree Weiß","Motion Sensor Tree White","Motion Sensor Tree White","Détecteur de mouvement Tree blanc","Detector de movimiento Tree","Motion Sensor Tree bilá","Sensore di movimento Tree bianco","Bewegungsmelder Tree Weiß","Motion Sensor Tree bilá","Bewegingsmelder Tree","not translated yet","not translated yet","not translated yet","not translated yet","not translated yet","not translated yet","not translated yet",null,null,null,null,null,74.5,60,86,74.5,74.5,1999,74.5,92.55,74.5,74.5,"Not done","Not done","Not done","Not done","Not done","Not done","Not done"]
[100225,"Stellantrieb Tree",65.5,null,null,100225,"Valve Actuator Tree",52.5,null,null,100225,"Valve Actuator Tree",76,null,null,100225,"Tête thermostatique Tree",65.5,null,null,100225,"Actuador Válvula Tree",65.5,null,null,100225,"Hlavice Tree",1749,null,null,100225,"Valvola termica Tree",65.5,null,null,100225,"Stellantrieb Tree",83.29,null,null,100225,"Hlavice Tree",65.5,null,null,100225,"Stelventiel Tree",65.5,null,null,"Not done","not translated yet","Not done",null,null,"Not done","not translated yet","Not done",null,"Not done","not translated yet","Not done",null,null,"Not done","not translated yet","Not done",null,null,"Not done","not translated yet","Not done",null,null,"Not done","not translated yet","Not done",null,null,"Not done","not translated yet","Not done",null,null,null,null,null,null,null,null,151,100225,100225,100225,100225,100225,100225,100225,100225,100225,100225,"Not done","Not done","Not done","Not done","Not done","Not done","Not done",null,null,null,null,"Stellantrieb Tree","Valve Actuator Tree","Valve Actuator Tree","Tête thermostatique Tree","Actuador Válvula Tree","Hlavice Tree","Valvola termica Tree","Stellantrieb Tree","Hlavice Tree","Stelventiel Tree","not translated yet","not translated yet","not translated yet","not translated yet","not translated yet","not translated yet","not translated yet",null,null,null,null,null,65.5,52.5,76,65.5,65.5,1749,65.5,83.29,65.5,65.5,"Not done","Not done","Not done","Not done","Not done","Not done","Not done"]
[100211,"Wassersensor Air",54,null,null,100211,"Water Sensor Air",42.5,null,null,100211,"Water Sensor Air",59,null,null,100211,"Capteur d'inondation Air",54,null,null,100211,"Sensor inundación Air",54,null,null,100211,"Záplavový senzor Air",1449,null,null,100211,"Sensore acqua Air",54,null,null,100211,"Wassersensor Air",64.77,null,null,100211,"Záplavový senzor Air",54,null,null,100211,"Waterrsensor Air",54,null,null,"Not done","not translated yet","Not done",null,null,"Not done","not translated yet","Not done",null,"Not done","not translated yet","Not done",null,null,"Not done","not translated yet","Not done",null,null,"Not done","not translated yet","Not done",null,null,"Not done","not translated yet","Not done",null,null,"Not done","not translated yet","Not done",null,null,null,null,null,null,null,null,152,100211,100211,100211,100211,100211,100211,100211,100211,100211,100211,"Not done","Not done","Not done","Not done","Not done","Not done","Not done",null,null,null,null,"Wassersensor Air","Water Sensor Air","Water Sensor Air","Capteur d'inondation Air","Sensor inundación Air","Záplavový senzor Air","Sensore acqua Air","Wassersensor Air","Záplavový senzor Air","Waterrsensor Air","not translated yet","not translated yet","not translated yet","not translated yet","not translated yet","not translated yet","not translated yet",null,null,null,null,null,54,42.5,59,54,54,1449,54,64.77,54,54,"Not done","Not done","Not done","Not done","Not done","Not done","Not done"]
[100213,"Tür- & Fensterkontakt Air Anthrazit",54,null,null,100213,"Door & Window Contact Air Anthracite",42.5,null,null,100213,"Door & Window Contact Air Black",59,null,null,100213,"Contact d'ouverture Air Anthracite",54,null,null,100213,"Contacto de puerta y ventana Air Antracita",54,null,null,100213,"Okenní a dveřní kontakt Air anthrazit",1449,null,null,100213,"Contatto finestra e porta Air antracite",54,null,null,100213,"Tür- & Fensterkontakt Air Anthrazit",64.77,null,null,100213,"Okenní a dveřní kontakt Air anthrazit",54,null,null,100213,"Raam- & Deurcontact Air Anthraciet",54,null,null,"Not done","not translated yet","Not done",null,null,"Not done","not translated yet","Not done",null,"Not done","not translated yet","Not done",null,null,"Not done","not translated yet","Not done",null,null,"Not done","not translated yet","Not done",null,null,"Not done","not translated yet","Not done",null,null,"Not done","not translated yet","Not done",null,null,null,null,null,null,null,null,153,100213,100213,100213,100213,100213,100213,100213,100213,100213,100213,"Not done","Not done","Not done","Not done","Not done","Not done","Not done",null,null,null,null,"Tür- & Fensterkontakt Air Anthrazit","Door & Window Contact Air Anthracite","Door & Window Contact Air Black","Contact d'ouverture Air Anthracite","Contacto de puerta y ventana Air Antracita","Okenní a dveřní kontakt Air anthrazit","Contatto finestra e porta Air antracite","Tür- & Fensterkontakt Air Anthrazit","Okenní a dveřní kontakt Air anthrazit","Raam- & Deurcontact Air Anthraciet","not translated yet","not translated yet","not translated yet","not translated yet","not translated yet","not translated yet","not translated yet",null,null,null,null,null,54,42.5,59,54,54,1449,54,64.77,54,54,"Not done","Not done","Not done","Not done","Not done","Not done","Not done"]
[100210,"Tür- & Fensterkontakt Air Weiß",54,null,null,100210,"Door & Window Contact Air White",42.5,null,null,100210,"Door & Window Contact Air White",59,null,null,100210,"Contact d'ouverture Air Blanc",54,null,null,100210,"Contacto de puerta y ventana Air Blanco",54,null,null,100210,"Okenní a dveřní kontakt Air bílá",1449,null,null,100210,"Contatto finestra e porta Air bianco",54,null,null,100210,"Tür- & Fensterkontakt Air Weiß",64.77,null,null,100210,"Okenní a dveřní kontakt Air bílá",54,null,null,100210,"Raam- & Deurcontact Air Wit",54,null,null,"Not done","not translated yet","Not done",null,null,"Not done","not translated yet","Not done",null,"Not done","not translated yet","Not done",null,null,"Not done","not translated yet","Not done",null,null,"Not done","not translated yet","Not done",null,null,"Not done","not translated yet","Not done",null,null,"Not done","not translated yet","Not done",null,null,null,null,null,null,null,null,154,100210,100210,100210,100210,100210,100210,100210,100210,100210,100210,"Not done","Not done","Not done","Not done","Not done","Not done","Not done",null,null,null,null,"Tür- & Fensterkontakt Air Weiß","Door & Window Contact Air White","Door & Window Contact Air White","Contact d'ouverture Air Blanc","Contacto de puerta y ventana Air Blanco","Okenní a dveřní kontakt Air bílá","Contatto finestra e porta Air bianco","Tür- & Fensterkontakt Air Weiß","Okenní a dveřní kontakt Air bílá","Raam- & Deurcontact Air Wit","not translated yet","not translated yet","not translated yet","not translated yet","not translated yet","not translated yet","not translated yet",null,null,null,null,null,54,42.5,59,54,54,1449,54,64.77,54,54,"Not done","Not done","Not done","Not done","Not done","Not done","Not done"]
[100224,"Bewegungsmelder Tree Anthrazit",74.5,null,null,100224,"Motion Sensor Tree Anthracite",60,null,null,100224,"Motion Sensor Tree Black",86,null,null,100224,"Détecteur de présence Tree Anthracite",74.5,null,null,100224,"Detector de movimiento Tree Antracita",74.5,null,null,100224,"Pohybový senzor Tree anthrazit",1999,null,null,100224,"Sensore di movimento Tree antracite",74.5,null,null,100224,"Bewegungsmelder Tree Anthrazit",92.55,null,null,100224,"Pohybový senzor Tree anthrazit",74.5,null,null,100224,"Bewegingsmelder Tree Antraciet",74.5,null,null,"Not done","not translated yet","Not done",null,null,"Not done","not translated yet","Not done",null,"Not done","not translated yet","Not done",null,null,"Not done","not translated yet","Not done",null,null,"Not done","not translated yet","Not done",null,null,"Not done","not translated yet","Not done",null,null,"Not done","not translated yet","Not done",null,null,null,null,null,null,null,null,155,100224,100224,100224,100224,100224,100224,100224,100224,100224,100224,"Not done","Not done","Not done","Not done","Not done","Not done","Not done",null,null,null,null,"Bewegungsmelder Tree Anthrazit","Motion Sensor Tree Anthracite","Motion Sensor Tree Black","Détecteur de présence Tree Anthracite","Detector de movimiento Tree Antracita","Pohybový senzor Tree anthrazit","Sensore di movimento Tree antracite","Bewegungsmelder Tree Anthrazit","Pohybový senzor Tree anthrazit","Bewegingsmelder Tree Antraciet","not translated yet","not translated yet","not translated yet","not translated yet","not translated yet","not translated yet","not translated yet",null,null,null,null,null,74.5,60,86,74.5,74.5,1999,74.5,92.55,74.5,74.5,"Not done","Not done","Not done","Not done","Not done","Not done","Not done"]
[200204,"Querverbinder 20 Pol (20 Stk.)",88,null,null,200204,"Cross Connector for Mains Terminals (20 pcs)",75,null,null,200204,"Cross Connector for Mains Terminals (20 pcs)",96,null,null,200204,"Peigne de connexion 20 pôles",88,null,null,200204,"Conector transversal 20 polos (20 Ud.)",88,null,null,200204,"20-ti pólová propojka Weidmuller (20 ks)",2399,null,null,200204,"Collegamento trasversale 20 poli (20pz.)",88,null,null,200204,"Querverbinder 20 Pol (20 Stk.)",110.19,null,null,200204,"20-ti pólová propojka Weidmuller (20 ks)",88,null,null,200204,"Weidmüller dwarsverbinder 20-polig (20) stuks)",88,null,null,"Not done","not translated yet","Not done",null,null,"Not done","not translated yet","Not done",null,"Not done","not translated yet","Not done",null,null,"Not done","not translated yet","Not done",null,null,"Not done","not translated yet","Not done",null,null,"Not done","not translated yet","Not done",null,null,"Not done","not translated yet","Not done",null,null,null,null,null,null,null,null,156,200204,200204,200204,200204,200204,200204,200204,200204,200204,200204,"Not done","Not done","Not done","Not done","Not done","Not done","Not done",null,null,null,null,"Querverbinder 20 Pol (20 Stk.)","Cross Connector for Mains Terminals (20 pcs)","Cross Connector for Mains Terminals (20 pcs)","Peigne de connexion 20 pôles","Conector transversal 20 polos (20 Ud.)","20-ti pólová propojka Weidmuller (20 ks)","Collegamento trasversale 20 poli (20pz.)","Querverbinder 20 Pol (20 Stk.)","20-ti pólová propojka Weidmuller (20 ks)","Weidmüller dwarsverbinder 20-polig (20) stuks)","not translated yet","not translated yet","not translated yet","not translated yet","not translated yet","not translated yet","not translated yet",null,null,null,null,null,88,75,96,88,88,2399,88,110.19,88,88,"Not done","Not done","Not done","Not done","Not done","Not done","Not done"]
[100200,"Dali Extension",449,null,null,100200,"Dali Extension",372.5,null,null,100200,"Dali Extension",499,null,null,100200,"Extension Dali",449,null,null,100200,"Dali Extension",449,null,null,100200,"Dali Extension",12199,null,null,100200,"Dali Extension",449,null,null,100200,"Dali Extension",582.41,null,null,100200,"Dali Extension",449,null,null,100200,"Dali Extension",449,null,null,"Not done","not translated yet","Not done",null,null,"Not done","not translated yet","Not done",null,"Not done","not translated yet","Not done",null,null,"Not done","not translated yet","Not done",null,null,"Not done","not translated yet","Not done",null,null,"Not done","not translated yet","Not done",null,null,"Not done","not translated yet","Not done",null,null,null,null,null,null,null,null,157,100200,100200,100200,100200,100200,100200,100200,100200,100200,100200,"Not done","Not done","Not done","Not done","Not done","Not done","Not done",null,null,null,null,"Dali Extension","Dali Extension","Dali Extension","Extension Dali","Dali Extension","Dali Extension","Dali Extension","Dali Extension","Dali Extension","Dali Extension","not translated yet","not translated yet","not translated yet","not translated yet","not translated yet","not translated yet","not translated yet",null,null,null,null,null,449,372.5,499,449,449,12199,449,582.41,449,449,"Not done","Not done","Not done","Not done","Not done","Not done","Not done"]
[200297,"LED Schaltnetzteil 24V 2.5A",29,null,null,200297,"24V LED Power Supply (2.5A)",24,null,null,200297,"24V LED Power Supply (2.5A)",35,null,null,200297,"Alimentation MeanWell 24V; 2,5A",29,null,null,200297,"Fuente de alimentación LED 24V 2.5A",29,null,null,200297,"Spínaný LED zdroj 24V 2,5A",799,null,null,200297,"Alimentatore LED 24V 2,5A",29,null,null,200297,"LED Schaltnetzteil 24V 2.5A",36.99,null,null,200297,"Spínaný LED zdroj 24V 2,5A",29,null,null,200297,"Led voeding 24V, 2,5 A",29,null,null,"Not done","not translated yet","Not done",null,null,"Not done","not translated yet","Not done",null,"Not done","not translated yet","Not done",null,null,"Not done","not translated yet","Not done",null,null,"Not done","not translated yet","Not done",null,null,"Not done","not translated yet","Not done",null,null,"Not done","not translated yet","Not done",null,null,null,null,null,null,null,null,158,200297,200297,200297,200297,200297,200297,200297,200297,200297,200297,"Not done","Not done","Not done","Not done","Not done","Not done","Not done",null,null,null,null,"LED Schaltnetzteil 24V 2.5A","24V LED Power Supply (2.5A)","24V LED Power Supply (2.5A)","Alimentation MeanWell 24V; 2,5A","Fuente de alimentación LED 24V 2.5A","Spínaný LED zdroj 24V 2,5A","Alimentatore LED 24V 2,5A","LED Schaltnetzteil 24V 2.5A","Spínaný LED zdroj 24V 2,5A","Led voeding 24V, 2,5 A","not translated yet","not translated yet","not translated yet","not translated yet","not translated yet","not translated yet","not translated yet",null,null,null,null,null,29,24,35,29,29,799,29,36.99,29,29,"Not done","Not done","Not done","Not done","Not done","Not done","Not done"]
[100206,"Touch pure Air Weiß",149,null,null,100206,"Touch pure Air White",120,null,null,100206,"Touch pure Air White",179,null,null,100206,"Touch Pure Blanc",149,null,null,100206,"Touch pure Air Blanco",149,null,null,100206,"Touch pure Air bílá",3999,null,null,100206,"Touch pure Air bianco",149,null,null,100206,"Touch pure Air Weiß",184.26,null,null,100206,"Touch pure Air bílá",149,null,null,100206,"Touch Pure AIR wit",149,null,null,"Not done","not translated yet","Not done",null,null,"Not done","not translated yet","Not done",null,"Not done","not translated yet","Not done",null,null,"Not done","not translated yet","Not done",null,null,"Not done","not translated yet","Not done",null,null,"Not done","not translated yet","Not done",null,null,"Not done","not translated yet","Not done",null,null,null,null,null,null,null,null,159,100206,100206,100206,100206,100206,100206,100206,100206,100206,100206,"Not done","Not done","Not done","Not done","Not done","Not done","Not done",null,null,null,null,"Touch pure Air Weiß","Touch pure Air White","Touch pure Air White","Touch Pure Blanc","Touch pure Air Blanco","Touch pure Air bílá","Touch pure Air bianco","Touch pure Air Weiß","Touch pure Air bílá","Touch Pure AIR wit","not translated yet","not translated yet","not translated yet","not translated yet","not translated yet","not translated yet","not translated yet",null,null,null,null,null,149,120,179,149,149,3999,149,184.26,149,149,"Not done","Not done","Not done","Not done","Not done","Not done","Not done"]
[100207,"Touch pure Nano Weiß",119,null,null,100207,"Touch pure for Nano White",95,null,null,100207,"Touch pure for Nano White",119,null,null,100207,"Touch Pure pour Nano Blanc",119,null,null,100207,"Touch pure Nano Blanco",119,null,null,100207,"Touch pure for Nano bílá",3199,null,null,100207,"Touch pure Nano bianco",119,null,null,100207,"Touch pure Nano Weiß",147.22,null,null,100207,"Touch pure for Nano bílá",119,null,null,100207,"Touch Pure NANO wit",119,null,null,"Not done","not translated yet","Not done",null,null,"Not done","not translated yet","Not done",null,"Not done","not translated yet","Not done",null,null,"Not done","not translated yet","Not done",null,null,"Not done","not translated yet","Not done",null,null,"Not done","not translated yet","Not done",null,null,"Not done","not translated yet","Not done",null,null,null,null,null,null,null,null,160,100207,100207,100207,100207,100207,100207,100207,100207,100207,100207,"Not done","Not done","Not done","Not done","Not done","Not done","Not done",null,null,null,null,"Touch pure Nano Weiß","Touch pure for Nano White","Touch pure for Nano White","Touch Pure pour Nano Blanc","Touch pure Nano Blanco","Touch pure for Nano bílá","Touch pure Nano bianco","Touch pure Nano Weiß","Touch pure for Nano bílá","Touch Pure NANO wit","not translated yet","not translated yet","not translated yet","not translated yet","not translated yet","not translated yet","not translated yet",null,null,null,null,null,119,95,119,119,119,3199,119,147.22,119,119,"Not done","Not done","Not done","Not done","Not done","Not done","Not done"]
[100219,"Touch pure Tree Weiß",149,null,null,100219,"Touch pure Tree White",120,null,null,100219,"Touch pure Tree White",179,null,null,100219,"Touch Pure Tree Blanc",149,null,null,100219,"Touch pure Tree Blanco",149,null,null,100219,"Touch pure Tree bílá",3999,null,null,100219,"Touch pure Tree bianco",149,null,null,100219,"Touch pure Tree Weiß",184.26,null,null,100219,"Touch pure Tree bílá",149,null,null,100219,"Touch Pure TREE wit",149,null,null,"Not done","not translated yet","Not done",null,null,"Not done","not translated yet","Not done",null,"Not done","not translated yet","Not done",null,null,"Not done","not translated yet","Not done",null,null,"Not done","not translated yet","Not done",null,null,"Not done","not translated yet","Not done",null,null,"Not done","not translated yet","Not done",null,null,null,null,null,null,null,null,161,100219,100219,100219,100219,100219,100219,100219,100219,100219,100219,"Not done","Not done","Not done","Not done","Not done","Not done","Not done",null,null,null,null,"Touch pure Tree Weiß","Touch pure Tree White","Touch pure Tree White","Touch Pure Tree Blanc","Touch pure Tree Blanco","Touch pure Tree bílá","Touch pure Tree bianco","Touch pure Tree Weiß","Touch pure Tree bílá","Touch Pure TREE wit","not translated yet","not translated yet","not translated yet","not translated yet","not translated yet","not translated yet","not translated yet",null,null,null,null,null,149,120,179,149,149,3999,149,184.26,149,149,"Not done","Not done","Not done","Not done","Not done","Not done","Not done"]
[200108,"Internorm Extension",249.16,null,null,"NA","not available in this country",0,null,null,"not available in this country","not available in this country",0,null,null,"not available in this country","not available in this country",249.16,null,null,"not available in this country","not available in this country",0,null,null,200108,"Internorm Extension",6799,null,null,200108,"Internorm Extension",249.16,null,null,100232,"Internorm Extencion",313.89,null,null,200108,"Internorm Extension",249.16,null,null,"not available in this country","not available in this country",0,null,null,"not available in this country","not available in this country",0,null,null,"not available in this country","not available in this country","not available in this country",null,"not available in this country","not available in this country","not available in this country",null,null,"Not done","not translated yet","Not done",null,null,"Not done","not translated yet","Not done",null,null,"Not done","not translated yet","Not done",null,null,"Not done","not translated yet","Not done",null,null,null,null,null,null,null,null,162,200108,"NA","not available in this country","not available in this country","not available in this country",200108,200108,100232,200108,"not available in this country","not available in this country","not available in this country","not available in this country","Not done","Not done","Not done","Not done",null,null,null,null,"Internorm Extension","not available in this country","not available in this country","not available in this country","not available in this country","Internorm Extension","Internorm Extension","Internorm Extencion","Internorm Extension","not available in this country","not available in this country","not available in this country","not available in this country","not translated yet","not translated yet","not translated yet","not translated yet",null,null,null,null,null,249.16,0,0,249.16,0,6799,249.16,313.89,249.16,0,0,"not available in this country","not available in this country","Not done","Not done","Not done","Not done"]
[100212,"Nano Dimmer Air",92,null,null,100212,"Nano Dimmer Air",75,null,null,"not available in this country","not available in this country",0,null,null,100212,"Nano Dimmer Air",92,null,null,100212,"Nano Dimmer Air",92,null,null,100212,"Nano Dimmer Air",2499,null,null,100212,"Nano Dimmer Air",92,null,null,100212,"Nano Dimmer Air",119.45,null,null,100212,"Nano Dimmer Air",92,null,null,100212,"Nano Dimmer Air",92,null,null,"Not done","not translated yet","Not done",null,null,"Not done","not translated yet","Not done",null,"Not done","not translated yet","Not done",null,null,"Not done","not translated yet","Not done",null,null,"Not done","not translated yet","Not done",null,null,"Not done","not translated yet","Not done",null,null,"Not done","not translated yet","Not done",null,null,null,null,null,null,null,null,163,100212,100212,"not available in this country",100212,100212,100212,100212,100212,100212,100212,"Not done","Not done","Not done","Not done","Not done","Not done","Not done",null,null,null,null,"Nano Dimmer Air","Nano Dimmer Air","not available in this country","Nano Dimmer Air","Nano Dimmer Air","Nano Dimmer Air","Nano Dimmer Air","Nano Dimmer Air","Nano Dimmer Air","Nano Dimmer Air","not translated yet","not translated yet","not translated yet","not translated yet","not translated yet","not translated yet","not translated yet",null,null,null,null,null,92,75,0,92,92,2499,92,119.45,92,92,"Not done","Not done","Not done","Not done","Not done","Not done","Not done"]
[200300,"Rangierdraht (100m) blau/weiß",11,null,null,"NA","not available in this country",0,null,null,200300,"Panel wire (328ft) blue/white",30.5,null,null,200300,"Câble d'interconnexion (100m) bleu/blanc",11,null,null,200300,"Cable para puentes (100mts) azul/blanco",11,null,null,200300,"Dvoužilový kroucený kabel modrá/bílá",299,null,null,200300,"Cavo due fili twistati (100m) blu/bianco",11,null,null,200300,"Rangierdraht (100m) blau/weiß",13.85,null,null,200300,"Dvoužilový kroucený kabel modrá/bílá",11,null,null,200300,"Verbindingsdraad (100m) blauw/wit",11,null,null,"Not done","not translated yet","Not done",null,null,"Not done","not translated yet","Not done",null,"Not done","not translated yet","Not done",null,null,"Not done","not translated yet","Not done",null,null,"Not done","not translated yet","Not done",null,null,"Not done","not translated yet","Not done",null,null,"Not done","not translated yet","Not done",null,null,null,null,null,null,null,null,164,200300,"NA",200300,200300,200300,200300,200300,200300,200300,200300,"Not done","Not done","Not done","Not done","Not done","Not done","Not done",null,null,null,null,"Rangierdraht (100m) blau/weiß","not available in this country","Panel wire (328ft) blue/white","Câble d'interconnexion (100m) bleu/blanc","Cable para puentes (100mts) azul/blanco","Dvoužilový kroucený kabel modrá/bílá","Cavo due fili twistati (100m) blu/bianco","Rangierdraht (100m) blau/weiß","Dvoužilový kroucený kabel modrá/bílá","Verbindingsdraad (100m) blauw/wit","not translated yet","not translated yet","not translated yet","not translated yet","not translated yet","not translated yet","not translated yet",null,null,null,null,null,11,0,30.5,11,11,299,11,13.85,11,11,"Not done","Not done","Not done","Not done","Not done","Not done","Not done"]
[200301,"Rangierdraht (100m) orange/weiß",11,null,null,"NA","not available in this country",0,null,null,200301,"Panel wire (328ft) orange/white",30.5,null,null,200301,"Câble d'interconnexion (100m) orange/blanc",11,null,null,200301,"Cable para puentes (100mts) naranja/blanco",11,null,null,200301,"Dvoužilový kroucený kabel oranžová/bílá",299,null,null,200301,"Cavo due fili twistati (100m) arancione/bianco",11,null,null,200301,"Rangierdraht (100m) orange/weiß",13.85,null,null,200301,"Dvoužilový kroucený kabel oranžová/bílá",11,null,null,200301,"Verbindingsdraad (100m) oranje/wit",11,null,null,"Not done","not translated yet","Not done",null,null,"Not done","not translated yet","Not done",null,"Not done","not translated yet","Not done",null,null,"Not done","not translated yet","Not done",null,null,"Not done","not translated yet","Not done",null,null,"Not done","not translated yet","Not done",null,null,"Not done","not translated yet","Not done",null,null,null,null,null,null,null,null,165,200301,"NA",200301,200301,200301,200301,200301,200301,200301,200301,"Not done","Not done","Not done","Not done","Not done","Not done","Not done",null,null,null,null,"Rangierdraht (100m) orange/weiß","not available in this country","Panel wire (328ft) orange/white","Câble d'interconnexion (100m) orange/blanc","Cable para puentes (100mts) naranja/blanco","Dvoužilový kroucený kabel oranžová/bílá","Cavo due fili twistati (100m) arancione/bianco","Rangierdraht (100m) orange/weiß","Dvoužilový kroucený kabel oranžová/bílá","Verbindingsdraad (100m) oranje/wit","not translated yet","not translated yet","not translated yet","not translated yet","not translated yet","not translated yet","not translated yet",null,null,null,null,null,11,0,30.5,11,11,299,11,13.85,11,11,"Not done","Not done","Not done","Not done","Not done","Not done","Not done"]
[200302,"Rangierdraht (100m) grün/weiß",11,null,null,"NA","not available in this country",0,null,null,200302,"Panel wire (328ft) green/white",30.5,null,null,200302,"Câble d'interconnexion (100m) vert/blanc",11,null,null,200302,"Cable para puentes (100mts) verde/blanco",11,null,null,200302,"Dvoužilový kroucený kabel zelená/bílá",299,null,null,200302,"Cavo due fili twistati (100m) verde/bianco",11,null,null,200302,"Rangierdraht (100m) grün/weiß",13.85,null,null,200302,"Dvoužilový kroucený kabel zelená/bílá",11,null,null,200302,"Verbindingsdraad (100m) groen/wit",11,null,null,"Not done","not translated yet","Not done",null,null,"Not done","not translated yet","Not done",null,"Not done","not translated yet","Not done",null,null,"Not done","not translated yet","Not done",null,null,"Not done","not translated yet","Not done",null,null,"Not done","not translated yet","Not done",null,null,"Not done","not translated yet","Not done",null,null,null,null,null,null,null,null,166,200302,"NA",200302,200302,200302,200302,200302,200302,200302,200302,"Not done","Not done","Not done","Not done","Not done","Not done","Not done",null,null,null,null,"Rangierdraht (100m) grün/weiß","not available in this country","Panel wire (328ft) green/white","Câble d'interconnexion (100m) vert/blanc","Cable para puentes (100mts) verde/blanco","Dvoužilový kroucený kabel zelená/bílá","Cavo due fili twistati (100m) verde/bianco","Rangierdraht (100m) grün/weiß","Dvoužilový kroucený kabel zelená/bílá","Verbindingsdraad (100m) groen/wit","not translated yet","not translated yet","not translated yet","not translated yet","not translated yet","not translated yet","not translated yet",null,null,null,null,null,11,0,30.5,11,11,299,11,13.85,11,11,"Not done","Not done","Not done","Not done","Not done","Not done","Not done"]
[200287,"Duracell Plus Power AA (12 Stk.)",9.5,null,null,200287,"Duracell Plus Power AA (Pack of 12)",8.25,null,null,"not available in this country","not available in this country",0,null,null,200287,"Duracell Plus Power AA (12 Stk.)",9.5,null,null,200287,"Duracell Plus Power AA (12 Stk.)",9.5,null,null,200287,"Duracell Plus Power AA (12 ks)",215,null,null,200287,"Duracell Plus Power AA (12 pz.)",9.5,null,null,200287,"Duracell Plus Power AA (12 Stk.)",13.85,null,null,200287,"Duracell Plus Power AA (12 ks)",9.5,null,null,200287,"Duracell Plus Power AA (12 St.)",9.5,null,null,"Not done","not translated yet","Not done",null,null,"Not done","not translated yet","Not done",null,"Not done","not translated yet","Not done",null,null,"Not done","not translated yet","Not done",null,null,"Not done","not translated yet","Not done",null,null,"Not done","not translated yet","Not done",null,null,"Not done","not translated yet","Not done",null,null,null,null,null,null,null,null,167,200287,200287,"not available in this country",200287,200287,200287,200287,200287,200287,200287,"Not done","Not done","Not done","Not done","Not done","Not done","Not done",null,null,null,null,"Duracell Plus Power AA (12 Stk.)","Duracell Plus Power AA (Pack of 12)","not available in this country","Duracell Plus Power AA (12 Stk.)","Duracell Plus Power AA (12 Stk.)","Duracell Plus Power AA (12 ks)","Duracell Plus Power AA (12 pz.)","Duracell Plus Power AA (12 Stk.)","Duracell Plus Power AA (12 ks)","Duracell Plus Power AA (12 St.)","not translated yet","not translated yet","not translated yet","not translated yet","not translated yet","not translated yet","not translated yet",null,null,null,null,null,9.5,8.25,0,9.5,9.5,215,9.5,13.85,9.5,9.5,"Not done","Not done","Not done","Not done","Not done","Not done","Not done"]
[200288,"Duracell Plus Power AAA (12 Stk.)",9.5,null,null,200288,"Duracell Plus Power AAA (Pack of 12)",8.25,null,null,"not available in this country","not available in this country",0,null,null,200288,"Duracell Plus Power AAA (12 Stk.)",9.5,null,null,200288,"Duracell Plus Power AAA (12 Stk.)",9.5,null,null,200288,"Duracell Plus Power AAA (12 ks)",215,null,null,200288,"Duracell Plus Power AAA (12 pz.)",9.5,null,null,200288,"Duracell Plus Power AAA (12 Stk.)",13.85,null,null,200288,"Duracell Plus Power AAA (12 ks)",9.5,null,null,200288,"Duracell Plus Power AAA (12 St.)",9.5,null,null,"Not done","not translated yet","Not done",null,null,"Not done","not translated yet","Not done",null,"Not done","not translated yet","Not done",null,null,"Not done","not translated yet","Not done",null,null,"Not done","not translated yet","Not done",null,null,"Not done","not translated yet","Not done",null,null,"Not done","not translated yet","Not done",null,null,null,null,null,null,null,null,168,200288,200288,"not available in this country",200288,200288,200288,200288,200288,200288,200288,"Not done","Not done","Not done","Not done","Not done","Not done","Not done",null,null,null,null,"Duracell Plus Power AAA (12 Stk.)","Duracell Plus Power AAA (Pack of 12)","not available in this country","Duracell Plus Power AAA (12 Stk.)","Duracell Plus Power AAA (12 Stk.)","Duracell Plus Power AAA (12 ks)","Duracell Plus Power AAA (12 pz.)","Duracell Plus Power AAA (12 Stk.)","Duracell Plus Power AAA (12 ks)","Duracell Plus Power AAA (12 St.)","not translated yet","not translated yet","not translated yet","not translated yet","not translated yet","not translated yet","not translated yet",null,null,null,null,null,9.5,8.25,0,9.5,9.5,215,9.5,13.85,9.5,9.5,"Not done","Not done","Not done","Not done","Not done","Not done","Not done"]
[200289,"Knopfzelle CR2032 (20 Stk. Z.B. Remote)",10,null,null,200289,"CR2032 Lithium Battery (Pack of 20)",8.25,null,null,"not available in this country","not available in this country",0,null,null,200289,"Pile bouton CR2032 (20 Stk. Z.B. Remote)",10,null,null,200289,"Pila botón CR2032 (20 Uni.)",10,null,null,200289,"CR2032 Lithium Battery (20 ks)",269,null,null,200289,"Pila a bottone CR2032 (20 pz. p.es. Remote)",10,null,null,200289,"Knopfzelle CR2032 (20 Stk. Z.B. Remote)",12.92,null,null,200289,"CR2032 Lithium Battery (20 ks)",10,null,null,200289,"Knoopbatterij CR2032 (20 St. vb. Remote)",10,null,null,"Not done","not translated yet","Not done",null,null,"Not done","not translated yet","Not done",null,"Not done","not translated yet","Not done",null,null,"Not done","not translated yet","Not done",null,null,"Not done","not translated yet","Not done",null,null,"Not done","not translated yet","Not done",null,null,"Not done","not translated yet","Not done",null,null,null,null,null,null,null,null,169,200289,200289,"not available in this country",200289,200289,200289,200289,200289,200289,200289,"Not done","Not done","Not done","Not done","Not done","Not done","Not done",null,null,null,null,"Knopfzelle CR2032 (20 Stk. Z.B. Remote)","CR2032 Lithium Battery (Pack of 20)","not available in this country","Pile bouton CR2032 (20 Stk. Z.B. Remote)","Pila botón CR2032 (20 Uni.)","CR2032 Lithium Battery (20 ks)","Pila a bottone CR2032 (20 pz. p.es. Remote)","Knopfzelle CR2032 (20 Stk. Z.B. Remote)","CR2032 Lithium Battery (20 ks)","Knoopbatterij CR2032 (20 St. vb. Remote)","not translated yet","not translated yet","not translated yet","not translated yet","not translated yet","not translated yet","not translated yet",null,null,null,null,null,10,8.25,0,10,10,269,10,12.92,10,10,"Not done","Not done","Not done","Not done","Not done","Not done","Not done"]
[200290,"Knopfzelle CR2450 (20 Stk. Z.B. Touch Air)",22.5,null,null,200290,"CR2450 Lithium Battery (Pack of 20)",18.75,null,null,"not available in this country","not available in this country",0,null,null,200290,"Pile bouton CR2450 (20 Stk. Z.B. Touch Air)",22.5,null,null,200290,"Pila botón CR2450 (20 Uni.)",22.5,null,null,200290,"CR2450 Lithium Battery (20 ks)",599,null,null,200290,"Pila a bottone CR2450 (20 pz. p.es. Touch Air)",22.5,null,null,200290,"Knopfzelle CR2450 (20 Stk. Z.B. Touch Air)",28.66,null,null,200290,"CR2450 Lithium Battery (20 ks)",22.5,null,null,200290,"Knoopbatterij CR2450 (20 St. vb. Touch Air)",22.5,null,null,"Not done","not translated yet","Not done",null,null,"Not done","not translated yet","Not done",null,"Not done","not translated yet","Not done",null,null,"Not done","not translated yet","Not done",null,null,"Not done","not translated yet","Not done",null,null,"Not done","not translated yet","Not done",null,null,"Not done","not translated yet","Not done",null,null,null,null,null,null,null,null,170,200290,200290,"not available in this country",200290,200290,200290,200290,200290,200290,200290,"Not done","Not done","Not done","Not done","Not done","Not done","Not done",null,null,null,null,"Knopfzelle CR2450 (20 Stk. Z.B. Touch Air)","CR2450 Lithium Battery (Pack of 20)","not available in this country","Pile bouton CR2450 (20 Stk. Z.B. Touch Air)","Pila botón CR2450 (20 Uni.)","CR2450 Lithium Battery (20 ks)","Pila a bottone CR2450 (20 pz. p.es. Touch Air)","Knopfzelle CR2450 (20 Stk. Z.B. Touch Air)","CR2450 Lithium Battery (20 ks)","Knoopbatterij CR2450 (20 St. vb. Touch Air)","not translated yet","not translated yet","not translated yet","not translated yet","not translated yet","not translated yet","not translated yet",null,null,null,null,null,22.5,18.75,0,22.5,22.5,599,22.5,28.66,22.5,22.5,"Not done","Not done","Not done","Not done","Not done","Not done","Not done"]
[200291,"FDK 9V Lithiumzelle (z.B. Rauchmelder Air)",9,null,null,200291,"FDK 9V Lithium Battery",7.5,null,null,"not available in this country","not available in this country",0,null,null,200291,"FDK 9V Pile Lithium (Ex. détecteur de fumée Air)",9,null,null,200291,"FDK 9V Pila Litio (ej det Humo)",9,null,null,200291,"FDK 9V Lithium Battery",245,null,null,200291,"FDK 9V batteria al litio (p.e.s. rilevatore fumo Air)",9,null,null,200291,"FDK 9V Lithiumzelle (z.B. Rauchmelder Air)",12,null,null,200291,"FDK 9V Lithium Battery",9,null,null,200291,"FDK 9V Lithiumbatterij (vb. Rookmelder Air)",9,null,null,"Not done","not translated yet","Not done",null,null,"Not done","not translated yet","Not done",null,"Not done","not translated yet","Not done",null,null,"Not done","not translated yet","Not done",null,null,"Not done","not translated yet","Not done",null,null,"Not done","not translated yet","Not done",null,null,"Not done","not translated yet","Not done",null,null,null,null,null,null,null,null,171,200291,200291,"not available in this country",200291,200291,200291,200291,200291,200291,200291,"Not done","Not done","Not done","Not done","Not done","Not done","Not done",null,null,null,null,"FDK 9V Lithiumzelle (z.B. Rauchmelder Air)","FDK 9V Lithium Battery","not available in this country","FDK 9V Pile Lithium (Ex. détecteur de fumée Air)","FDK 9V Pila Litio (ej det Humo)","FDK 9V Lithium Battery","FDK 9V batteria al litio (p.e.s. rilevatore fumo Air)","FDK 9V Lithiumzelle (z.B. Rauchmelder Air)","FDK 9V Lithium Battery","FDK 9V Lithiumbatterij (vb. Rookmelder Air)","not translated yet","not translated yet","not translated yet","not translated yet","not translated yet","not translated yet","not translated yet",null,null,null,null,null,9,7.5,0,9,9,245,9,12,9,9,"Not done","Not done","Not done","Not done","Not done","Not done","Not done"]
[100242,"Nano DI Tree",62,null,null,100242,"Nano DI Tree",52.5,null,null,100242,"Nano DI Tree",69,null,null,100242,"Interface BP Tree",62,null,null,100242,"Nano DI Tree",62,null,null,100242,"Nano DI Tree",1699,null,null,100242,"Nano DI Tree",62,null,null,100242,"Nano DI Tree",86.57,null,null,100242,"Nano DI Tree",62,null,null,100242,"Nano DI Tree",62,null,null,"Not done","not translated yet","Not done",null,null,"Not done","not translated yet","Not done",null,"Not done","not translated yet","Not done",null,null,"Not done","not translated yet","Not done",null,null,"Not done","not translated yet","Not done",null,null,"Not done","not translated yet","Not done",null,null,"Not done","not translated yet","Not done",null,null,null,null,null,null,null,null,172,100242,100242,100242,100242,100242,100242,100242,100242,100242,100242,"Not done","Not done","Not done","Not done","Not done","Not done","Not done",null,null,null,null,"Nano DI Tree","Nano DI Tree","Nano DI Tree","Interface BP Tree","Nano DI Tree","Nano DI Tree","Nano DI Tree","Nano DI Tree","Nano DI Tree","Nano DI Tree","not translated yet","not translated yet","not translated yet","not translated yet","not translated yet","not translated yet","not translated yet",null,null,null,null,null,62,52.5,69,62,62,1699,62,86.57,62,62,"Not done","Not done","Not done","Not done","Not done","Not done","Not done"]
[0,"Feller Adapter Set x10",0,null,null,"not available in this country","not available in this country",0,null,null,"not available in this country","not available in this country",0,null,null,0,"Feller adaptateur complet/ 10 pièces",0,null,null,"not available in this country","not available in this country",0,null,null,"not available in this country","not available in this country",0,null,null,0,"Feller Adattatore Completo/ 10 pezzi",0,null,null,100294,"Feller Adapter Set x10",83.3,null,null,"not available in this country","not available in this country",0,null,null,"not available in this country","not available in this country",0,null,null,"Not done","not translated yet","Not done",null,null,"Not done","not translated yet","Not done",null,"Not done","not translated yet","Not done",null,null,"not available in this country","not available in this country",0,null,null,"not available in this country","not available in this country",0,null,null,"not available in this country","not available in this country",0,null,null,"not available in this country","not available in this country",0,null,null,null,null,null,null,null,null,173,0,"not available in this country","not available in this country",0,"not available in this country","not available in this country",0,100294,"not available in this country","not available in this country","Not done","Not done","Not done","not available in this country","not available in this country","not available in this country","not available in this country",null,null,null,null,"Feller Adapter Set x10","not available in this country","not available in this country","Feller adaptateur complet/ 10 pièces","not available in this country","not available in this country","Feller Adattatore Completo/ 10 pezzi","Feller Adapter Set x10","not available in this country","not available in this country","not translated yet","not translated yet","not translated yet","not available in this country","not available in this country","not available in this country","not available in this country",null,null,null,null,null,0,0,0,0,0,0,0,83.3,0,0,"Not done","Not done","Not done",0,0,0,0]
[100209,"Touch pure Nano Anthrazit",119,null,null,100209,"Touch pure for Nano Anthracite",95,null,null,100209,"Touch pure Nano Black",119,null,null,100209,"Touch pure for Nano Anthracite",119,null,null,100209,"Touch pure para Nano Antracita",119,null,null,100209,"Touch pure for Nano Anthracite",3199,null,null,100209,"Touch pure Nano antracite",119,null,null,100209,"Touch pure Nano anthrazit",147.22,null,null,100209,"Touch pure for Nano Anthracite",119,null,null,100209,"Touch pure Nano Anthraciet",119,null,null,"Not done","not translated yet","Not done",null,null,"Not done","not translated yet","Not done",null,"Not done","not translated yet","Not done",null,null,"Not done","not translated yet","Not done",null,null,"Not done","not translated yet","Not done",null,null,"Not done","not translated yet","Not done",null,null,"Not done","not translated yet","Not done",null,null,null,null,null,null,null,null,174,{"$f":"A177","v":100209},100209,100209,100209,100209,100209,100209,100209,100209,100209,"Not done","Not done","Not done","Not done","Not done","Not done","Not done",null,null,null,null,{"$f":"B177","v":"Touch pure Nano Anthrazit"},"Touch pure for Nano Anthracite","Touch pure Nano Black","Touch pure for Nano Anthracite","Touch pure para Nano Antracita","Touch pure for Nano Anthracite","Touch pure Nano antracite","Touch pure Nano anthrazit","Touch pure for Nano Anthracite","Touch pure Nano Anthraciet","not translated yet","not translated yet","not translated yet","not translated yet","not translated yet","not translated yet","not translated yet",null,null,null,null,null,{"$f":"C177","v":119},95,119,119,119,3199,119,147.22,119,119,"Not done","Not done","Not done","Not done","Not done","Not done","Not done"]
[100220,"Touch pure Tree Anthrazit",149,null,null,100220,"Touch pure for Tree Anthracite",120,null,null,100220,"Touch pure Tree Black",179,null,null,100220,"Touch pure Tree Anthracite",149,null,null,100220,"Touch pure Tree Antracita",149,null,null,100220,"Touch pure for Tree Anthracite",3999,null,null,100220,"Touch pure Tree antracite",149,null,null,100220,"Touch pure Tree anthrazit",184.26,null,null,100220,"Touch pure for Tree Anthracite",149,null,null,100220,"Touch pure Tree Anthraciet",149,null,null,"Not done","not translated yet","Not done",null,null,"Not done","not translated yet","Not done",null,"Not done","not translated yet","Not done",null,null,"Not done","not translated yet","Not done",null,null,"Not done","not translated yet","Not done",null,null,"Not done","not translated yet","Not done",null,null,"Not done","not translated yet","Not done",null,null,null,null,null,null,null,null,175,100220,100220,100220,100220,100220,100220,100220,100220,100220,100220,"Not done","Not done","Not done","Not done","Not done","Not done","Not done",null,null,null,null,"Touch pure Tree Anthrazit","Touch pure for Tree Anthracite","Touch pure Tree Black","Touch pure Tree Anthracite","Touch pure Tree Antracita","Touch pure for Tree Anthracite","Touch pure Tree antracite","Touch pure Tree anthrazit","Touch pure for Tree Anthracite","Touch pure Tree Anthraciet","not translated yet","not translated yet","not translated yet","not translated yet","not translated yet","not translated yet","not translated yet",null,null,null,null,null,149,120,179,149,149,3999,149,184.26,149,149,"Not done","Not done","Not done","Not done","Not done","Not done","Not done"]
[100208,"Touch pure Air Anthrazit",149,null,null,100208,"Touch pure Air Anthracite",120,null,null,100208,"Touch pure Air Black",179,null,null,100208,"Touch pure Air Anthracite",149,null,null,100208,"Touch pure Air Antracita",149,null,null,100208,"Touch pure Air Anthracite",3999,null,null,100208,"Touch pure Air antracite",149,null,null,100208,"Touch pure Air anthrazit",184.26,null,null,100208,"Touch pure Air Anthracite",149,null,null,100208,"Touch pure Air Anthraciet",149,null,null,"Not done","not translated yet","Not done",null,null,"Not done","not translated yet","Not done",null,"Not done","not translated yet","Not done",null,null,"Not done","not translated yet","Not done",null,null,"Not done","not translated yet","Not done",null,null,"Not done","not translated yet","Not done",null,null,"Not done","not translated yet","Not done",null,null,null,null,null,null,null,null,176,100208,100208,100208,100208,100208,100208,100208,100208,100208,100208,"Not done","Not done","Not done","Not done","Not done","Not done","Not done",null,null,null,null,"Touch pure Air Anthrazit","Touch pure Air Anthracite","Touch pure Air Black","Touch pure Air Anthracite","Touch pure Air Antracita","Touch pure Air Anthracite","Touch pure Air antracite","Touch pure Air anthrazit","Touch pure Air Anthracite","Touch pure Air Anthraciet","not translated yet","not translated yet","not translated yet","not translated yet","not translated yet","not translated yet","not translated yet",null,null,null,null,null,149,120,179,149,149,3999,149,184.26,149,149,"Not done","Not done","Not done","Not done","Not done","Not done","Not done"]
[100235,"LED Aufbauspot RGBW weiß",79,null,null,100235,"LED Ceiling Spot RGBW",65,null,null,100235,"LED Ceiling Spot RGBW",89,null,null,100235,"Spot LED Plafonnier RGBW",79,null,null,100235,"LED Spot RGBW de Superfície",79,null,null,100235,"Příložný LED Spot RGBW bílá",2149,null,null,100235,"Led spot da soffitto RGBW bianco",79,null,null,100235,"LED Aufbauspot RGBW weiß",111.11,null,null,100235,"Příložný LED Spot RGBW bílá",79,null,null,100235,"LED Ceiling Spot RGBW",79,null,null,"Not done","not translated yet","Not done",null,null,"Not done","not translated yet","Not done",null,"Not done","not translated yet","Not done",null,null,"Not done","not translated yet","Not done",null,null,"Not done","not translated yet","Not done",null,null,"Not done","not translated yet","Not done",null,null,"Not done","not translated yet","Not done",null,null,null,null,null,null,null,null,177,{"$f":"A180","v":100235},100235,100235,100235,100235,100235,100235,100235,100235,100235,"Not done","Not done","Not done","Not done","Not done","Not done","Not done",null,null,null,null,{"$f":"B180","v":"LED Aufbauspot RGBW weiß"},"LED Ceiling Spot RGBW","LED Ceiling Spot RGBW","Spot LED Plafonnier RGBW","LED Spot RGBW de Superfície","Příložný LED Spot RGBW bílá","Led spot da soffitto RGBW bianco","LED Aufbauspot RGBW weiß","Příložný LED Spot RGBW bílá","LED Ceiling Spot RGBW","not translated yet","not translated yet","not translated yet","not translated yet","not translated yet","not translated yet","not translated yet",null,null,null,null,null,{"$f":"C180","v":79},65,89,79,79,2149,79,111.11,79,79,"Not done","Not done","Not done","Not done","Not done","Not done","Not done"]
[100236,"LED Aufbauspot WW weiß",59,null,null,100236,"LED Ceiling Spot WW",47.5,null,null,100236,"LED Ceiling Spot WW",69,null,null,100236,"Spot LED Plafonnier WW",59,null,null,100236,"LED Spot WW de Superfície",59,null,null,100236,"Příložný LED Spot WW bílá",1599,null,null,100236,"Led spot da soffitto WW bianco",59,null,null,100236,"LED Aufbauspot WW weiß",83.33,null,null,100236,"Příložný LED Spot WW bílá",59,null,null,100236,"LED Ceiling Spot WW",59,null,null,"Not done","not translated yet","Not done",null,null,"Not done","not translated yet","Not done",null,"Not done","not translated yet","Not done",null,null,"Not done","not translated yet","Not done",null,null,"Not done","not translated yet","Not done",null,null,"Not done","not translated yet","Not done",null,null,"Not done","not translated yet","Not done",null,null,null,null,null,null,null,null,178,100236,100236,100236,100236,100236,100236,100236,100236,100236,100236,"Not done","Not done","Not done","Not done","Not done","Not done","Not done",null,null,null,null,"LED Aufbauspot WW weiß","LED Ceiling Spot WW","LED Ceiling Spot WW","Spot LED Plafonnier WW","LED Spot WW de Superfície","Příložný LED Spot WW bílá","Led spot da soffitto WW bianco","LED Aufbauspot WW weiß","Příložný LED Spot WW bílá","LED Ceiling Spot WW","not translated yet","not translated yet","not translated yet","not translated yet","not translated yet","not translated yet","not translated yet",null,null,null,null,null,59,47.5,69,59,59,1599,59,83.33,59,59,"Not done","Not done","Not done","Not done","Not done","Not done","Not done"]
[100237,"LED Aufbauspot Tree RGBW weiß",119,null,null,100237,"LED Ceiling Spot Tree RGBW",100,null,null,100237,"LED Ceiling Spot Tree RGBW",139,null,null,100237,"Spot LED Plafonnier Tree RGBW",119,null,null,100237,"LED Spot Tree RGBW de Superfície",119,null,null,100237,"Příložný LED Spot Tree RGBW bílá",3199,null,null,100237,"Led spot da soffitto Tree RGBW bianco",119,null,null,100237,"LED Aufbauspot Tree RGBW weiß",166.67,null,null,100237,"Příložný LED Spot Tree RGBW bílá",119,null,null,100237,"LED Ceiling Spot Tree RGBW",119,null,null,"Not done","not translated yet","Not done",null,null,"Not done","not translated yet","Not done",null,"Not done","not translated yet","Not done",null,null,"Not done","not translated yet","Not done",null,null,"Not done","not translated yet","Not done",null,null,"Not done","not translated yet","Not done",null,null,"Not done","not translated yet","Not done",null,null,null,null,null,null,null,null,179,100237,100237,100237,100237,100237,100237,100237,100237,100237,100237,"Not done","Not done","Not done","Not done","Not done","Not done","Not done",null,null,null,null,"LED Aufbauspot Tree RGBW weiß","LED Ceiling Spot Tree RGBW","LED Ceiling Spot Tree RGBW","Spot LED Plafonnier Tree RGBW","LED Spot Tree RGBW de Superfície","Příložný LED Spot Tree RGBW bílá","Led spot da soffitto Tree RGBW bianco","LED Aufbauspot Tree RGBW weiß","Příložný LED Spot Tree RGBW bílá","LED Ceiling Spot Tree RGBW","not translated yet","not translated yet","not translated yet","not translated yet","not translated yet","not translated yet","not translated yet",null,null,null,null,null,119,100,139,119,119,3199,119,166.67,119,119,"Not done","Not done","Not done","Not done","Not done","Not done","Not done"]
[100238,"LED Aufbauspot Tree WW weiß",99,null,null,100238,"LED Ceiling Spot Tree WW",82.5,null,null,100238,"LED Ceiling Spot Tree WW",109,null,null,100238,"Spot LED Plafonnier Tree WW",99,null,null,100238,"LED Spot Tree WW de Superfície",99,null,null,100238,"Příložný LED Spot Tree WW bílá",2699,null,null,100238,"Led spot da soffitto Tree WW bianco",99,null,null,100238,"LED Aufbauspot Tree WW weiß",138.88999999999999,null,null,100238,"Příložný LED Spot Tree WW bílá",99,null,null,100238,"LED Ceiling Spot Tree WW",99,null,null,"Not done","not translated yet","Not done",null,null,"Not done","not translated yet","Not done",null,"Not done","not translated yet","Not done",null,null,"Not done","not translated yet","Not done",null,null,"Not done","not translated yet","Not done",null,null,"Not done","not translated yet","Not done",null,null,"Not done","not translated yet","Not done",null,null,null,null,null,null,null,null,180,100238,100238,100238,100238,100238,100238,100238,100238,100238,100238,"Not done","Not done","Not done","Not done","Not done","Not done","Not done",null,null,null,null,"LED Aufbauspot Tree WW weiß","LED Ceiling Spot Tree WW","LED Ceiling Spot Tree WW","Spot LED Plafonnier Tree WW","LED Spot Tree WW de Superfície","Příložný LED Spot Tree WW bílá","Led spot da soffitto Tree WW bianco","LED Aufbauspot Tree WW weiß","Příložný LED Spot Tree WW bílá","LED Ceiling Spot Tree WW","not translated yet","not translated yet","not translated yet","not translated yet","not translated yet","not translated yet","not translated yet",null,null,null,null,null,99,82.5,109,99,99,2699,99,138.88999999999999,99,99,"Not done","Not done","Not done","Not done","Not done","Not done","Not done"]
[100268,"LED Spot Tree WW weiß",59,null,null,100268,"LED Spot Tree WW",47.5,null,null,100268,"LED Spot Tree WW",69,null,null,100268,"Spot LED Tree WW",59,null,null,100268,"LED Spot Tree WW",59,null,null,100268,"LED Spot Tree WW bílá",1599,null,null,100268,"Led spot Tree WW bianco",59,null,null,100268,"Led Spot Tree WW weiß",83.33,null,null,100268,"LED Spot Tree WW bílá",59,null,null,100268,"LED Spot Tree WW",59,null,null,"Not done","not translated yet","Not done",null,null,"Not done","not translated yet","Not done",null,"Not done","not translated yet","Not done",null,null,"Not done","not translated yet","Not done",null,null,"Not done","not translated yet","Not done",null,null,"Not done","not translated yet","Not done",null,null,"Not done","not translated yet","Not done",null,null,null,null,null,null,null,null,181,100268,100268,100268,100268,100268,100268,100268,100268,100268,100268,"Not done","Not done","Not done","Not done","Not done","Not done","Not done",null,null,null,null,"LED Spot Tree WW weiß","LED Spot Tree WW","LED Spot Tree WW","Spot LED Tree WW","LED Spot Tree WW","LED Spot Tree WW bílá","Led spot Tree WW bianco","Led Spot Tree WW weiß","LED Spot Tree WW bílá","LED Spot Tree WW","not translated yet","not translated yet","not translated yet","not translated yet","not translated yet","not translated yet","not translated yet",null,null,null,null,null,59,47.5,69,59,59,1599,59,83.33,59,59,"Not done","Not done","Not done","Not done","Not done","Not done","Not done"]
[100269,"LED Spot Tree RGBW weiß",79,null,null,100269,"LED Spot Tree RGBW",65,null,null,100269,"LED Spot Tree RGBW",89,null,null,100269,"Spot LED Tree RGBW",79,null,null,100269,"LED Spot Tree RGBW",79,null,null,100269,"LED Spot Tree RGBW bílá",2149,null,null,100269,"Led spot Tree RGBW bianco",79,null,null,100269,"Led Spot Tree RGBW weiß",111.11,null,null,100269,"LED Spot Tree RGBW bílá",79,null,null,100269,"LED Spot Tree RGBW",79,null,null,"Not done","not translated yet","Not done",null,null,"Not done","not translated yet","Not done",null,"Not done","not translated yet","Not done",null,null,"Not done","not translated yet","Not done",null,null,"Not done","not translated yet","Not done",null,null,"Not done","not translated yet","Not done",null,null,"Not done","not translated yet","Not done",null,null,null,null,null,null,null,null,182,100269,100269,100269,100269,100269,100269,100269,100269,100269,100269,"Not done","Not done","Not done","Not done","Not done","Not done","Not done",null,null,null,null,"LED Spot Tree RGBW weiß","LED Spot Tree RGBW","LED Spot Tree RGBW","Spot LED Tree RGBW","LED Spot Tree RGBW","LED Spot Tree RGBW bílá","Led spot Tree RGBW bianco","Led Spot Tree RGBW weiß","LED Spot Tree RGBW bílá","LED Spot Tree RGBW","not translated yet","not translated yet","not translated yet","not translated yet","not translated yet","not translated yet","not translated yet",null,null,null,null,null,79,65,89,79,79,2149,79,111.11,79,79,"Not done","Not done","Not done","Not done","Not done","Not done","Not done"]
[100239,"RGBW 24V Dimmer Tree",59.9,null,null,100239,"RGBW 24V Dimmer Tree",55,null,null,100239,"RGBW 24V Dimmer Tree",69,null,null,100239,"RGBW 24V Dimmer Tree",59.9,null,null,100239,"RGBW 24V Dimmer Tree",59.9,null,null,100239,"RGBW 24V Dimmer Tree",1599,null,null,100239,"RGBW 24V Dimmer Tree",59.9,null,null,100239,"RGBW 24V Dimmer Tree",83.34,null,null,100239,"RGBW 24V Dimmer Tree",59.9,null,null,100239,"RGBW 24V Dimmer Tree",59.9,null,null,"Not done","not translated yet","Not done",null,null,"Not done","not translated yet","Not done",null,"Not done","not translated yet","Not done",null,null,"Not done","not translated yet","Not done",null,null,"Not done","not translated yet","Not done",null,null,"Not done","not translated yet","Not done",null,null,"Not done","not translated yet","Not done",null,null,null,null,null,null,null,null,183,100239,100239,100239,100239,100239,100239,100239,100239,100239,100239,"Not done","Not done","Not done","Not done","Not done","Not done","Not done",null,null,null,null,"RGBW 24V Dimmer Tree","RGBW 24V Dimmer Tree","RGBW 24V Dimmer Tree","RGBW 24V Dimmer Tree","RGBW 24V Dimmer Tree","RGBW 24V Dimmer Tree","RGBW 24V Dimmer Tree","RGBW 24V Dimmer Tree","RGBW 24V Dimmer Tree","RGBW 24V Dimmer Tree","not translated yet","not translated yet","not translated yet","not translated yet","not translated yet","not translated yet","not translated yet",null,null,null,null,null,59.9,55,69,59.9,59.9,1599,59.9,83.34,59.9,59.9,"Not done","Not done","Not done","Not done","Not done","Not done","Not done"]
[null,"Digital IN (Reserve)",null,null,null,null,"Digital IN (Reserve)",null,null,null,"Not done","Digital IN (Reserve)","Not done",null,null,null,"Digital IN (Reserve)",null,null,null,null,"Digital IN (Reserve)",null,null,null,null,"Digital IN (Reserve)",null,null,null,null,"Digital IN (Reserve)",null,null,null,null,"Digital IN (Reserve)",null,null,null,null,"Digital IN (Reserve)",null,null,null,null,"Digital IN (Reserve)",null,null,null,"Not done","not translated yet","Not done",null,null,"Not done","not translated yet","Not done",null,"Not done","not translated yet","Not done",null,null,"Not done","not translated yet","Not done",null,null,"Not done","not translated yet","Not done",null,null,"Not done","not translated yet","Not done",null,null,"Not done","not translated yet","Not done",null,null,null,null,null,null,null,null,184,0,0,"Not done",0,0,0,0,0,0,0,"Not done","Not done","Not done","Not done","Not done","Not done","Not done",null,null,null,null,"Digital IN (Reserve)","Digital IN (Reserve)","Digital IN (Reserve)","Digital IN (Reserve)","Digital IN (Reserve)","Digital IN (Reserve)","Digital IN (Reserve)","Digital IN (Reserve)","Digital IN (Reserve)","Digital IN (Reserve)","not translated yet","not translated yet","not translated yet","not translated yet","not translated yet","not translated yet","not translated yet",null,null,null,null,null,0,0,"Not done",0,0,0,0,0,0,0,"Not done","Not done","Not done","Not done","Not done","Not done","Not done"]
[null,"Analog IN (Reserve)",null,null,null,null,"Analog IN (Reserve)",null,null,null,"Not done","Analog IN (Reserve)","Not done",null,null,null,"Analog IN (Reserve)",null,null,null,null,"Analog IN (Reserve)",null,null,null,null,"Analog IN (Reserve)",null,null,null,null,"Analog IN (Reserve)",null,null,null,null,"Analog IN (Reserve)",null,null,null,null,"Analog IN (Reserve)",null,null,null,null,"Analog IN (Reserve)",null,null,null,"Not done","not translated yet","Not done",null,null,"Not done","not translated yet","Not done",null,"Not done","not translated yet","Not done",null,null,"Not done","not translated yet","Not done",null,null,"Not done","not translated yet","Not done",null,null,"Not done","not translated yet","Not done",null,null,"Not done","not translated yet","Not done",null,null,null,null,null,null,null,null,185,0,0,"Not done",0,0,0,0,0,0,0,"Not done","Not done","Not done","Not done","Not done","Not done","Not done",null,null,null,null,"Analog IN (Reserve)","Analog IN (Reserve)","Analog IN (Reserve)","Analog IN (Reserve)","Analog IN (Reserve)","Analog IN (Reserve)","Analog IN (Reserve)","Analog IN (Reserve)","Analog IN (Reserve)","Analog IN (Reserve)","not translated yet","not translated yet","not translated yet","not translated yet","not translated yet","not translated yet","not translated yet",null,null,null,null,null,0,0,"Not done",0,0,0,0,0,0,0,"Not done","Not done","Not done","Not done","Not done","Not done","Not done"]
[100177,"Fenstergriff Air",120,null,null,100177,"Window Handle Air",102.5,null,null,100177,"Window Handle Air",139,null,null,100177,"Poignée de fenêtre Air",120,null,null,100177,"Manilla Ventana Air",120,null,null,100177,"Okenní klika Air",3249,null,null,100177,"Maniglia finestra Air",120,null,null,100177,"Fenstergriff Air",166.66,null,null,100177,"Okenní klika Air",120,null,null,100177,"Vensterhandgreep Air",120,null,null,"Not done","not translated yet","Not done",null,null,"Not done","not translated yet","Not done",null,"Not done","not translated yet","Not done",null,null,"Not done","not translated yet","Not done",null,null,"Not done","not translated yet","Not done",null,null,"Not done","not translated yet","Not done",null,null,"Not done","not translated yet","Not done",null,null,null,null,null,null,null,null,186,100177,100177,100177,100177,100177,100177,100177,100177,100177,100177,"Not done","Not done","Not done","Not done","Not done","Not done","Not done",null,null,null,null,"Fenstergriff Air","Window Handle Air","Window Handle Air","Poignée de fenêtre Air","Manilla Ventana Air","Okenní klika Air","Maniglia finestra Air","Fenstergriff Air","Okenní klika Air","Vensterhandgreep Air","not translated yet","not translated yet","not translated yet","not translated yet","not translated yet","not translated yet","not translated yet",null,null,null,null,null,120,102.5,139,120,120,3249,120,166.66,120,120,"Not done","Not done","Not done","Not done","Not done","Not done","Not done"]
[100283,"DI Extension",220,null,null,100283,"DI Extension",187.5,null,null,100283,"not translated yet","Not done",null,null,100283,"not translated yet","Not done",null,null,100283,"DI Extension",null,null,null,100283,"DI Extension",5999,null,null,100283,"Translate from EN_UK or DE",null,null,null,100283,"DI Extension",308.33,null,null,100283,"DI Extension",220,null,null,100283,"DI Extension",220,null,null,"Not done","not translated yet","Not done",null,null,"Not done","not translated yet","Not done",null,"Not done","not translated yet","Not done",null,null,"Not done","not translated yet","Not done",null,null,"Not done","not translated yet","Not done",null,null,"Not done","not translated yet","Not done",null,null,"Not done","not translated yet","Not done",null,null,null,null,null,null,null,null,187,100283,100283,100283,100283,100283,100283,100283,100283,100283,100283,"Not done","Not done","Not done","Not done","Not done","Not done","Not done",null,null,null,null,"DI Extension","DI Extension","not translated yet","not translated yet","DI Extension","DI Extension","Translate from EN_UK or DE","DI Extension","DI Extension","DI Extension","not translated yet","not translated yet","not translated yet","not translated yet","not translated yet","not translated yet","not translated yet",null,null,null,null,null,220,187.5,"Not done","Not done",0,5999,0,308.33,220,220,"Not done","Not done","Not done","Not done","Not done","Not done","Not done"]
[100246,"Wetterstation Tree",389,null,null,100246,"Weather Station Tree",333.33,null,null,100246,"not translated yet","Not done",null,null,100246,"not translated yet","Not done",null,null,100246,"Estación Meteorológica Tree",null,null,null,100246,"Meteostanice Tree",7199,null,null,100246,"Translate from EN_UK or DE",null,null,null,100246,"Wetterstation Tree",375,null,null,100246,"Meteostanice Tree",389,null,null,100246,"Weerstation Tree",389,null,null,"Not done","not translated yet","Not done",null,null,"Not done","not translated yet","Not done",null,"Not done","not translated yet","Not done",null,null,"Not done","not translated yet","Not done",null,null,"Not done","not translated yet","Not done",null,null,"Not done","not translated yet","Not done",null,null,"Not done","not translated yet","Not done",null,null,null,null,null,null,null,null,188,100246,100246,100246,100246,100246,100246,100246,100246,100246,100246,"Not done","Not done","Not done","Not done","Not done","Not done","Not done",null,null,null,null,"Wetterstation Tree","Weather Station Tree","not translated yet","not translated yet","Estación Meteorológica Tree","Meteostanice Tree","Translate from EN_UK or DE","Wetterstation Tree","Meteostanice Tree","Weerstation Tree","not translated yet","not translated yet","not translated yet","not translated yet","not translated yet","not translated yet","not translated yet",null,null,null,null,null,389,333.33,"Not done","Not done",0,7199,0,375,389,389,"Not done","Not done","Not done","Not done","Not done","Not done","Not done"]
[100245,"Wetterstation Air",419,null,null,100245,"Weather Station Air",350,null,null,100245,"not translated yet","Not done",null,null,100245,"not translated yet","Not done",null,null,100245,"Estación Meteorológica Air",null,null,null,100245,"Meteostanice Air",7999,null,null,100245,"Translate from EN_UK or DE",null,null,null,100245,"Wetterstation Air",416.66,null,null,100245,"Meteostanice Air",419,null,null,100245,"Weerstation Air",419,null,null,"Not done","not translated yet","Not done",null,null,"Not done","not translated yet","Not done",null,"Not done","not translated yet","Not done",null,null,"Not done","not translated yet","Not done",null,null,"Not done","not translated yet","Not done",null,null,"Not done","not translated yet","Not done",null,null,"Not done","not translated yet","Not done",null,null,null,null,null,null,null,null,189,100245,100245,100245,100245,100245,100245,100245,100245,100245,100245,"Not done","Not done","Not done","Not done","Not done","Not done","Not done",null,null,null,null,"Wetterstation Air","Weather Station Air","not translated yet","not translated yet","Estación Meteorológica Air","Meteostanice Air","Translate from EN_UK or DE","Wetterstation Air","Meteostanice Air","Weerstation Air","not translated yet","not translated yet","not translated yet","not translated yet","not translated yet","not translated yet","not translated yet",null,null,null,null,null,419,350,"Not done","Not done",0,7999,0,416.66,419,419,"Not done","Not done","Not done","Not done","Not done","Not done","Not done"]
[200311,"LED Spot Beton Einbaubox",22,null,null,200311,"LED Spot back box for cast concrete",20,null,null,200311,"not translated yet","Not done",null,null,200311,"not translated yet","Not done",null,null,200311,"Caja Hormigón LED Spot",null,null,null,200311,"Krabice do betonu pro LED spot",599,null,null,200311,"Translate from EN_UK or DE",null,null,null,200311,"LED Spot Beton Einbaubox","Not done",null,null,200311,"Krabice do betonu pro LED spot",22,null,null,200311,"LED spot beton inbouwbox",22,null,null,"Not done","not translated yet","Not done",null,null,"Not done","not translated yet","Not done",null,"Not done","not translated yet","Not done",null,null,"Not done","not translated yet","Not done",null,null,"Not done","not translated yet","Not done",null,null,"Not done","not translated yet","Not done",null,null,"Not done","not translated yet","Not done",null,null,null,null,null,null,null,null,190,200311,200311,200311,200311,200311,200311,200311,200311,200311,200311,"Not done","Not done","Not done","Not done","Not done","Not done","Not done",null,null,null,null,"LED Spot Beton Einbaubox","LED Spot back box for cast concrete","not translated yet","not translated yet","Caja Hormigón LED Spot","Krabice do betonu pro LED spot","Translate from EN_UK or DE","LED Spot Beton Einbaubox","Krabice do betonu pro LED spot","LED spot beton inbouwbox","not translated yet","not translated yet","not translated yet","not translated yet","not translated yet","not translated yet","not translated yet",null,null,null,null,null,22,20,"Not done","Not done",0,599,0,"Not done",22,22,"Not done","Not done","Not done","Not done","Not done","Not done","Not done"]
[100251,"Jalousieantrieb GJ56 Air - Kastenöffnung oben 6Nm",238.74,null,null,100251,"Blind Motor GJ56 Air 6Nm connection at top",205,null,null,100251,"not translated yet","Not done",null,null,100251,"not translated yet","Not done",null,null,100251,"Motor Veneciana GJ56 Air - conexión superior 6Nm",null,null,null,100251,"Žaluziový pohon GJ56 Air 6Nm kabel nahoře",6499,null,null,100251,"Translate from EN_UK or DE",null,null,null,100251,"Jalousieantrieb GJ56 Air - Kastenöffnung oben 6Nm","Not done",null,null,100251,"Žaluziový pohon GJ56 Air 6Nm kabel nahoře",238.74,null,null,100251,"Jaloezie motor GJ56 Air - Kast opening boven 6Nm",238.74,null,null,"Not done","not translated yet","Not done",null,null,"Not done","not translated yet","Not done",null,"Not done","not translated yet","Not done",null,null,"Not done","not translated yet","Not done",null,null,"Not done","not translated yet","Not done",null,null,"Not done","not translated yet","Not done",null,null,"Not done","not translated yet","Not done",null,null,null,null,null,null,null,null,191,100251,100251,100251,100251,100251,100251,100251,100251,100251,100251,"Not done","Not done","Not done","Not done","Not done","Not done","Not done",null,null,null,null,"Jalousieantrieb GJ56 Air - Kastenöffnung oben 6Nm","Blind Motor GJ56 Air 6Nm connection at top","not translated yet","not translated yet","Motor Veneciana GJ56 Air - conexión superior 6Nm","Žaluziový pohon GJ56 Air 6Nm kabel nahoře","Translate from EN_UK or DE","Jalousieantrieb GJ56 Air - Kastenöffnung oben 6Nm","Žaluziový pohon GJ56 Air 6Nm kabel nahoře","Jaloezie motor GJ56 Air - Kast opening boven 6Nm","not translated yet","not translated yet","not translated yet","not translated yet","not translated yet","not translated yet","not translated yet",null,null,null,null,null,238.74,205,"Not done","Not done",0,6499,0,"Not done",238.74,238.74,"Not done","Not done","Not done","Not done","Not done","Not done","Not done"]
[100252,"Jalousieantrieb GJ56 Air - Kastenöffnung oben 20Nm",279.73,null,null,100252,"Blind Motor GJ56 Air 20Nm connection at top",240,null,null,100252,"not translated yet","Not done",null,null,100252,"not translated yet","Not done",null,null,100252,"Motor Veneciana GJ56 Air - conexión superior 20Nm",null,null,null,100252,"Žaluziový pohon GJ56 Air 20Nm kabel nahoře",7549,null,null,100252,"Translate from EN_UK or DE",null,null,null,100252,"Jalousieantrieb GJ56 Air - Kastenöffnung oben 20Nm","Not done",null,null,100252,"Žaluziový pohon GJ56 Air 20Nm kabel nahoře",279.73,null,null,100252,"Jaloezie motor GJ56 Air - Kast opening boven 20Nm",279.73,null,null,"Not done","not translated yet","Not done",null,null,"Not done","not translated yet","Not done",null,"Not done","not translated yet","Not done",null,null,"Not done","not translated yet","Not done",null,null,"Not done","not translated yet","Not done",null,null,"Not done","not translated yet","Not done",null,null,"Not done","not translated yet","Not done",null,null,null,null,null,null,null,null,192,100252,100252,100252,100252,100252,100252,100252,100252,100252,100252,"Not done","Not done","Not done","Not done","Not done","Not done","Not done",null,null,null,null,"Jalousieantrieb GJ56 Air - Kastenöffnung oben 20Nm","Blind Motor GJ56 Air 20Nm connection at top","not translated yet","not translated yet","Motor Veneciana GJ56 Air - conexión superior 20Nm","Žaluziový pohon GJ56 Air 20Nm kabel nahoře","Translate from EN_UK or DE","Jalousieantrieb GJ56 Air - Kastenöffnung oben 20Nm","Žaluziový pohon GJ56 Air 20Nm kabel nahoře","Jaloezie motor GJ56 Air - Kast opening boven 20Nm","not translated yet","not translated yet","not translated yet","not translated yet","not translated yet","not translated yet","not translated yet",null,null,null,null,null,279.73,240,"Not done","Not done",0,7549,0,"Not done",279.73,279.73,"Not done","Not done","Not done","Not done","Not done","Not done","Not done"]
[100253,"Jalousieantrieb GJ56 Air - Kastenöffnung unten 6Nm",238.74,null,null,100251,"Blind Motor GJ56 Air 6Nm connection at bottom",205,null,null,100251,"not translated yet","Not done",null,null,100251,"not translated yet","Not done",null,null,100251,"Motor Veneciana GJ56 Air - conexión inferior 6Nm",null,null,null,100251,"Žaluziový pohon GJ56 Air 6Nm kabel dole",6499,null,null,100251,"Translate from EN_UK or DE",null,null,null,100251,"Jalousieantrieb GJ56 Air - Kastenöffnung unten 6Nm","Not done",null,null,100251,"Žaluziový pohon GJ56 Air 6Nm kabel dole",238.74,null,null,100253,"Jaloezie motor GJ56 Air - Kast opening onder 6Nm",238.74,null,null,"Not done","not translated yet","Not done",null,null,"Not done","not translated yet","Not done",null,"Not done","not translated yet","Not done",null,null,"Not done","not translated yet","Not done",null,null,"Not done","not translated yet","Not done",null,null,"Not done","not translated yet","Not done",null,null,"Not done","not translated yet","Not done",null,null,null,null,null,null,null,null,193,100253,{"$f":"F196","v":100251},100251,100251,100251,100251,100251,100251,100251,100253,"Not done","Not done","Not done","Not done","Not done","Not done","Not done",null,null,null,null,"Jalousieantrieb GJ56 Air - Kastenöffnung unten 6Nm","Blind Motor GJ56 Air 6Nm connection at bottom","not translated yet","not translated yet","Motor Veneciana GJ56 Air - conexión inferior 6Nm","Žaluziový pohon GJ56 Air 6Nm kabel dole","Translate from EN_UK or DE","Jalousieantrieb GJ56 Air - Kastenöffnung unten 6Nm","Žaluziový pohon GJ56 Air 6Nm kabel dole","Jaloezie motor GJ56 Air - Kast opening onder 6Nm","not translated yet","not translated yet","not translated yet","not translated yet","not translated yet","not translated yet","not translated yet",null,null,null,null,null,238.74,205,"Not done","Not done",0,6499,0,"Not done",238.74,238.74,"Not done","Not done","Not done","Not done","Not done","Not done","Not done"]
[100254,"Jalousieantrieb GJ56 Air - Kastenöffnung unten 20Nm",279.73,null,null,100252,"Blind Motor GJ56 Air 20Nm connection at bottom",240,null,null,100252,"not translated yet","Not done",null,null,100252,"not translated yet","Not done",null,null,100252,"Motor Veneciana GJ56 Air - conexión inferior 20Nm",null,null,null,100252,"Žaluziový pohon GJ56 Air 20Nm kabel dole",7549,null,null,100252,"Translate from EN_UK or DE",null,null,null,100252,"Jalousieantrieb GJ56 Air - Kastenöffnung unten 20Nm","Not done",null,null,100252,"Žaluziový pohon GJ56 Air 20Nm kabel dole",279.73,null,null,100254,"Jaloezie motor GJ56 Air - Kast opening onder 20Nm",279.73,null,null,"Not done","not translated yet","Not done",null,null,"Not done","not translated yet","Not done",null,"Not done","not translated yet","Not done",null,null,"Not done","not translated yet","Not done",null,null,"Not done","not translated yet","Not done",null,null,"Not done","not translated yet","Not done",null,null,"Not done","not translated yet","Not done",null,null,null,null,null,null,null,null,194,{"$f":"A197","v":100254},100252,{"$f":"K197","v":100252},{"$f":"P197","v":100252},{"$f":"U197","v":100252},{"$f":"Z197","v":100252},{"$f":"AE197","v":100252},{"$f":"AJ197","v":100252},{"$f":"AO197","v":100252},{"$f":"AT197","v":100254},{"$f":"AY197","v":"Not done"},{"$f":"BD197","v":"Not done"},{"$f":"BH197","v":"Not done"},{"$f":"BM197","v":"Not done"},{"$f":"BR197","v":"Not done"},{"$f":"BW197","v":"Not done"},{"$f":"CB197","v":"Not done"},null,null,null,null,{"$f":"B197","v":"Jalousieantrieb GJ56 Air - Kastenöffnung unten 20Nm"},{"$f":"G197","v":"Blind Motor GJ56 Air 20Nm connection at bottom"},{"$f":"L197","v":"not translated yet"},{"$f":"Q197","v":"not translated yet"},{"$f":"V197","v":"Motor Veneciana GJ56 Air - conexión inferior 20Nm"},{"$f":"AA197","v":"Žaluziový pohon GJ56 Air 20Nm kabel dole"},{"$f":"AF197","v":"Translate from EN_UK or DE"},{"$f":"AK197","v":"Jalousieantrieb GJ56 Air - Kastenöffnung unten 20Nm"},{"$f":"AP197","v":"Žaluziový pohon GJ56 Air 20Nm kabel dole"},{"$f":"AU197","v":"Jaloezie motor GJ56 Air - Kast opening onder 20Nm"},{"$f":"AZ197","v":"not translated yet"},{"$f":"BE197","v":"not translated yet"},{"$f":"BI197","v":"not translated yet"},{"$f":"BN197","v":"not translated yet"},{"$f":"BS197","v":"not translated yet"},{"$f":"BX197","v":"not translated yet"},{"$f":"CC197","v":"not translated yet"},null,null,null,null,null,{"$f":"C197","v":279.73},{"$f":"H197","v":240},{"$f":"M197","v":"Not done"},{"$f":"R197","v":"Not done"},{"$f":"W197","v":0},{"$f":"AB197","v":7549},{"$f":"AG197","v":0},{"$f":"AL197","v":"Not done"},{"$f":"AQ197","v":279.73},{"$f":"AV197","v":279.73},{"$f":"BA197","v":"Not done"},{"$f":"BF197","v":"Not done"},{"$f":"BJ197","v":"Not done"},{"$f":"BO197","v":"Not done"},{"$f":"BT197","v":"Not done"},{"$f":"BY197","v":"Not done"},{"$f":"CD197","v":"Not done"}]
[null,null,null,null,null,null,null,null,null,null,"Not done","not translated yet","Not done",null,null,"Not done","not translated yet","Not done",null,null,null,"Translate from EN_UK or DE",null,null,null,null,"Translate from EN_UK or DE",null,null,null,null,"Translate from EN_UK or DE",null,null,null,"Not done","not translated yet","Not done",null,null,null,"Translate from EN_UK or DE",null,null,null,null,"Translate from EN_UK or DE",null,null,null,"Not done","not translated yet","Not done",null,null,"Not done","not translated yet","Not done",null,"Not done","not translated yet","Not done",null,null,"Not done","not translated yet","Not done",null,null,"Not done","not translated yet","Not done",null,null,"Not done","not translated yet","Not done",null,null,"Not done","not translated yet","Not done",null,null,null,null,null,null,null,null,195,0,0,"Not done","Not done",0,0,0,"Not done",0,0,"Not done","Not done","Not done","Not done","Not done","Not done","Not done",null,null,null,null,0,0,"not translated yet","not translated yet","Translate from EN_UK or DE","Translate from EN_UK or DE","Translate from EN_UK or DE","not translated yet","Translate from EN_UK or DE","Translate from EN_UK or DE","not translated yet","not translated yet","not translated yet","not translated yet","not translated yet","not translated yet","not translated yet",null,null,null,null,null,0,0,"Not done","Not done",0,0,0,"Not done",0,0,"Not done","Not done","Not done","Not done","Not done","Not done","Not done"]
[null,null,null,null,null,null,null,null,null,null,"Not done","not translated yet","Not done",null,null,"Not done","not translated yet","Not done",null,null,null,"Translate from EN_UK or DE",null,null,null,null,"Translate from EN_UK or DE",null,null,null,null,"Translate from EN_UK or DE",null,null,null,"Not done","not translated yet","Not done",null,null,null,"Translate from EN_UK or DE",null,null,null,null,"Translate from EN_UK or DE",null,null,null,"Not done","not translated yet","Not done",null,null,"Not done","not translated yet","Not done",null,"Not done","not translated yet","Not done",null,null,"Not done","not translated yet","Not done",null,null,"Not done","not translated yet","Not done",null,null,"Not done","not translated yet","Not done",null,null,"Not done","not translated yet","Not done",null,null,null,null,null,null,null,null,196,0,0,"Not done","Not done",0,0,0,"Not done",0,0,"Not done","Not done","Not done","Not done","Not done","Not done","Not done",null,null,null,null,0,0,"not translated yet","not translated yet","Translate from EN_UK or DE","Translate from EN_UK or DE","Translate from EN_UK or DE","not translated yet","Translate from EN_UK or DE","Translate from EN_UK or DE","not translated yet","not translated yet","not translated yet","not translated yet","not translated yet","not translated yet","not translated yet",null,null,null,null,null,0,0,"Not done","Not done",0,0,0,"Not done",0,0,"Not done","Not done","Not done","Not done","Not done","Not done","Not done"]
[null,null,null,null,null,null,null,null,null,null,"Not done","not translated yet","Not done",null,null,"Not done","not translated yet","Not done",null,null,null,"Translate from EN_UK or DE",null,null,null,null,"Translate from EN_UK or DE",null,null,null,null,"Translate from EN_UK or DE",null,null,null,"Not done","not translated yet","Not done",null,null,null,"Translate from EN_UK or DE",null,null,null,null,"Translate from EN_UK or DE",null,null,null,"Not done","not translated yet","Not done",null,null,"Not done","not translated yet","Not done",null,"Not done","not translated yet","Not done",null,null,"Not done","not translated yet","Not done",null,null,"Not done","not translated yet","Not done",null,null,"Not done","not translated yet","Not done",null,null,"Not done","not translated yet","Not done",null,null,null,null,null,null,null,null,197,0,0,"Not done","Not done",0,0,0,"Not done",0,0,"Not done","Not done","Not done","Not done","Not done","Not done","Not done",null,null,null,null,0,0,"not translated yet","not translated yet","Translate from EN_UK or DE","Translate from EN_UK or DE","Translate from EN_UK or DE","not translated yet","Translate from EN_UK or DE","Translate from EN_UK or DE","not translated yet","not translated yet","not translated yet","not translated yet","not translated yet","not translated yet","not translated yet",null,null,null,null,null,0,0,"Not done","Not done",0,0,0,"Not done",0,0,"Not done","Not done","Not done","Not done","Not done","Not done","Not done"]
[null,null,null,null,null,null,null,null,null,null,"Not done","not translated yet","Not done",null,null,"Not done","not translated yet","Not done",null,null,null,"Translate from EN_UK or DE",null,null,null,null,"Translate from EN_UK or DE",null,null,null,null,"Translate from EN_UK or DE",null,null,null,"Not done","not translated yet","Not done",null,null,null,"Translate from EN_UK or DE",null,null,null,null,"Translate from EN_UK or DE",null,null,null,"Not done","not translated yet","Not done",null,null,"Not done","not translated yet","Not done",null,"Not done","not translated yet","Not done",null,null,"Not done","not translated yet","Not done",null,null,"Not done","not translated yet","Not done",null,null,"Not done","not translated yet","Not done",null,null,"Not done","not translated yet","Not done",null,null,null,null,null,null,null,null,198,0,0,"Not done","Not done",0,0,0,"Not done",0,0,"Not done","Not done","Not done","Not done","Not done","Not done","Not done",null,null,null,null,0,0,"not translated yet","not translated yet","Translate from EN_UK or DE","Translate from EN_UK or DE","Translate from EN_UK or DE","not translated yet","Translate from EN_UK or DE","Translate from EN_UK or DE","not translated yet","not translated yet","not translated yet","not translated yet","not translated yet","not translated yet","not translated yet",null,null,null,null,null,0,0,"Not done","Not done",0,0,0,"Not done",0,0,"Not done","Not done","Not done","Not done","Not done","Not done","Not done"]
[null,null,null,null,null,null,null,null,null,null,"Not done","not translated yet","Not done",null,null,"Not done","not translated yet","Not done",null,null,null,"Translate from EN_UK or DE",null,null,null,null,"Translate from EN_UK or DE",null,null,null,null,"Translate from EN_UK or DE",null,null,null,"Not done","not translated yet","Not done",null,null,null,"Translate from EN_UK or DE",null,null,null,null,"Translate from EN_UK or DE",null,null,null,"Not done","not translated yet","Not done",null,null,"Not done","not translated yet","Not done",null,"Not done","not translated yet","Not done",null,null,"Not done","not translated yet","Not done",null,null,"Not done","not translated yet","Not done",null,null,"Not done","not translated yet","Not done",null,null,"Not done","not translated yet","Not done",null,null,null,null,null,null,null,null,199,0,0,"Not done","Not done",0,0,0,"Not done",0,0,"Not done","Not done","Not done","Not done","Not done","Not done","Not done",null,null,null,null,0,0,"not translated yet","not translated yet","Translate from EN_UK or DE","Translate from EN_UK or DE","Translate from EN_UK or DE","not translated yet","Translate from EN_UK or DE","Translate from EN_UK or DE","not translated yet","not translated yet","not translated yet","not translated yet","not translated yet","not translated yet","not translated yet",null,null,null,null,null,0,0,"Not done","Not done",0,0,0,"Not done",0,0,"Not done","Not done","Not done","Not done","Not done","Not done","Not done"]
[null,null,null,null,null,null,null,null,null,null,"Not done","not translated yet","Not done",null,null,"Not done","not translated yet","Not done",null,null,null,"Translate from EN_UK or DE",null,null,null,null,"Translate from EN_UK or DE",null,null,null,null,"Translate from EN_UK or DE",null,null,null,"Not done","not translated yet","Not done",null,null,null,"Translate from EN_UK or DE",null,null,null,null,"Translate from EN_UK or DE",null,null,null,"Not done","not translated yet","Not done",null,null,"Not done","not translated yet","Not done",null,"Not done","not translated yet","Not done",null,null,"Not done","not translated yet","Not done",null,null,"Not done","not translated yet","Not done",null,null,"Not done","not translated yet","Not done",null,null,"Not done","not translated yet","Not done",null,null,null,null,null,null,null,null,200,0,0,"Not done","Not done",0,0,0,"Not done",0,0,"Not done","Not done","Not done","Not done","Not done","Not done","Not done",null,null,null,null,0,0,"not translated yet","not translated yet","Translate from EN_UK or DE","Translate from EN_UK or DE","Translate from EN_UK or DE","not translated yet","Translate from EN_UK or DE","Translate from EN_UK or DE","not translated yet","not translated yet","not translated yet","not translated yet","not translated yet","not translated yet","not translated yet",null,null,null,null,null,0,0,"Not done","Not done",0,0,0,"Not done",0,0,"Not done","Not done","Not done","Not done","Not done","Not done","Not done"]
[null,null,null,null,null,null,null,null,null,null,"Not done","not translated yet","Not done",null,null,"Not done","not translated yet","Not done",null,null,null,"Translate from EN_UK or DE",null,null,null,null,"Translate from EN_UK or DE",null,null,null,null,"Translate from EN_UK or DE",null,null,null,"Not done","not translated yet","Not done",null,null,null,"Translate from EN_UK or DE",null,null,null,null,"Translate from EN_UK or DE",null,null,null,"Not done","not translated yet","Not done",null,null,"Not done","not translated yet","Not done",null,"Not done","not translated yet","Not done",null,null,"Not done","not translated yet","Not done",null,null,"Not done","not translated yet","Not done",null,null,"Not done","not translated yet","Not done",null,null,"Not done","not translated yet","Not done",null,null,null,null,null,null,null,null,201,0,0,"Not done","Not done",0,0,0,"Not done",0,0,"Not done","Not done","Not done","Not done","Not done","Not done","Not done",null,null,null,null,0,0,"not translated yet","not translated yet","Translate from EN_UK or DE","Translate from EN_UK or DE","Translate from EN_UK or DE","not translated yet","Translate from EN_UK or DE","Translate from EN_UK or DE","not translated yet","not translated yet","not translated yet","not translated yet","not translated yet","not translated yet","not translated yet",null,null,null,null,null,0,0,"Not done","Not done",0,0,0,"Not done",0,0,"Not done","Not done","Not done","Not done","Not done","Not done","Not done"]
[null,null,null,null,null,null,null,null,null,null,"Not done","not translated yet","Not done",null,null,"Not done","not translated yet","Not done",null,null,null,"Translate from EN_UK or DE",null,null,null,null,"Translate from EN_UK or DE",null,null,null,null,"Translate from EN_UK or DE",null,null,null,"Not done","not translated yet","Not done",null,null,null,"Translate from EN_UK or DE",null,null,null,null,"Translate from EN_UK or DE",null,null,null,"Not done","not translated yet","Not done",null,null,"Not done","not translated yet","Not done",null,"Not done","not translated yet","Not done",null,null,"Not done","not translated yet","Not done",null,null,"Not done","not translated yet","Not done",null,null,"Not done","not translated yet","Not done",null,null,"Not done","not translated yet","Not done",null,null,null,null,null,null,null,null,202,0,0,"Not done","Not done",0,0,0,"Not done",0,0,"Not done","Not done","Not done","Not done","Not done","Not done","Not done",null,null,null,null,0,0,"not translated yet","not translated yet","Translate from EN_UK or DE","Translate from EN_UK or DE","Translate from EN_UK or DE","not translated yet","Translate from EN_UK or DE","Translate from EN_UK or DE","not translated yet","not translated yet","not translated yet","not translated yet","not translated yet","not translated yet","not translated yet",null,null,null,null,null,0,0,"Not done","Not done",0,0,0,"Not done",0,0,"Not done","Not done","Not done","Not done","Not done","Not done","Not done"]
[null,null,null,null,null,null,null,null,null,null,"Not done","not translated yet","Not done",null,null,"Not done","not translated yet","Not done",null,null,null,"Translate from EN_UK or DE",null,null,null,null,"Translate from EN_UK or DE",null,null,null,null,"Translate from EN_UK or DE",null,null,null,"Not done","not translated yet","Not done",null,null,null,"Translate from EN_UK or DE",null,null,null,null,"Translate from EN_UK or DE",null,null,null,"Not done","not translated yet","Not done",null,null,"Not done","not translated yet","Not done",null,"Not done","not translated yet","Not done",null,null,"Not done","not translated yet","Not done",null,null,"Not done","not translated yet","Not done",null,null,"Not done","not translated yet","Not done",null,null,"Not done","not translated yet","Not done",null,null,null,null,null,null,null,null,203,0,0,"Not done","Not done",0,0,0,"Not done",0,0,"Not done","Not done","Not done","Not done","Not done","Not done","Not done",null,null,null,null,0,0,"not translated yet","not translated yet","Translate from EN_UK or DE","Translate from EN_UK or DE","Translate from EN_UK or DE","not translated yet","Translate from EN_UK or DE","Translate from EN_UK or DE","not translated yet","not translated yet","not translated yet","not translated yet","not translated yet","not translated yet","not translated yet",null,null,null,null,null,0,0,"Not done","Not done",0,0,0,"Not done",0,0,"Not done","Not done","Not done","Not done","Not done","Not done","Not done"]
[null,null,null,null,null,null,null,null,null,null,"Not done","not translated yet","Not done",null,null,"Not done","not translated yet","Not done",null,null,null,"Translate from EN_UK or DE",null,null,null,null,"Translate from EN_UK or DE",null,null,null,null,"Translate from EN_UK or DE",null,null,null,"Not done","not translated yet","Not done",null,null,null,"Translate from EN_UK or DE",null,null,null,null,"Translate from EN_UK or DE",null,null,null,"Not done","not translated yet","Not done",null,null,"Not done","not translated yet","Not done",null,"Not done","not translated yet","Not done",null,null,"Not done","not translated yet","Not done",null,null,"Not done","not translated yet","Not done",null,null,"Not done","not translated yet","Not done",null,null,"Not done","not translated yet","Not done",null,null,null,null,null,null,null,null,204,0,0,"Not done","Not done",0,0,0,"Not done",0,0,"Not done","Not done","Not done","Not done","Not done","Not done","Not done",null,null,null,null,0,0,"not translated yet","not translated yet","Translate from EN_UK or DE","Translate from EN_UK or DE","Translate from EN_UK or DE","not translated yet","Translate from EN_UK or DE","Translate from EN_UK or DE","not translated yet","not translated yet","not translated yet","not translated yet","not translated yet","not translated yet","not translated yet",null,null,null,null,null,0,0,"Not done","Not done",0,0,0,"Not done",0,0,"Not done","Not done","Not done","Not done","Not done","Not done","Not done"]
[null,null,null,null,null,null,null,null,null,null,"Not done","not translated yet","Not done",null,null,"Not done","not translated yet","Not done",null,null,null,"Translate from EN_UK or DE",null,null,null,null,"Translate from EN_UK or DE",null,null,null,null,"Translate from EN_UK or DE",null,null,null,"Not done","not translated yet","Not done",null,null,null,"Translate from EN_UK or DE",null,null,null,null,"Translate from EN_UK or DE",null,null,null,"Not done","not translated yet","Not done",null,null,"Not done","not translated yet","Not done",null,"Not done","not translated yet","Not done",null,null,"Not done","not translated yet","Not done",null,null,"Not done","not translated yet","Not done",null,null,"Not done","not translated yet","Not done",null,null,"Not done","not translated yet","Not done",null,null,null,null,null,null,null,null,205,0,0,"Not done","Not done",0,0,0,"Not done",0,0,"Not done","Not done","Not done","Not done","Not done","Not done","Not done",null,null,null,null,0,0,"not translated yet","not translated yet","Translate from EN_UK or DE","Translate from EN_UK or DE","Translate from EN_UK or DE","not translated yet","Translate from EN_UK or DE","Translate from EN_UK or DE","not translated yet","not translated yet","not translated yet","not translated yet","not translated yet","not translated yet","not translated yet",null,null,null,null,null,0,0,"Not done","Not done",0,0,0,"Not done",0,0,"Not done","Not done","Not done","Not done","Not done","Not done","Not done"]
[null,null,null,null,null,null,null,null,null,null,"Not done","not translated yet","Not done",null,null,"Not done","not translated yet","Not done",null,null,null,"Translate from EN_UK or DE",null,null,null,null,"Translate from EN_UK or DE",null,null,null,null,"Translate from EN_UK or DE",null,null,null,"Not done","not translated yet","Not done",null,null,null,"Translate from EN_UK or DE",null,null,null,null,"Translate from EN_UK or DE",null,null,null,"Not done","not translated yet","Not done",null,null,"Not done","not translated yet","Not done",null,"Not done","not translated yet","Not done",null,null,"Not done","not translated yet","Not done",null,null,"Not done","not translated yet","Not done",null,null,"Not done","not translated yet","Not done",null,null,"Not done","not translated yet","Not done",null,null,null,null,null,null,null,null,206,0,0,"Not done","Not done",0,0,0,"Not done",0,0,"Not done","Not done","Not done","Not done","Not done","Not done","Not done",null,null,null,null,0,0,"not translated yet","not translated yet","Translate from EN_UK or DE","Translate from EN_UK or DE","Translate from EN_UK or DE","not translated yet","Translate from EN_UK or DE","Translate from EN_UK or DE","not translated yet","not translated yet","not translated yet","not translated yet","not translated yet","not translated yet","not translated yet",null,null,null,null,null,0,0,"Not done","Not done",0,0,0,"Not done",0,0,"Not done","Not done","Not done","Not done","Not done","Not done","Not done"]
[null,null,null,null,null,null,null,null,null,null,"Not done","not translated yet","Not done",null,null,"Not done","not translated yet","Not done",null,null,null,"Translate from EN_UK or DE",null,null,null,null,"Translate from EN_UK or DE",null,null,null,null,"Translate from EN_UK or DE",null,null,null,"Not done","not translated yet","Not done",null,null,null,"Translate from EN_UK or DE",null,null,null,null,"Translate from EN_UK or DE",null,null,null,"Not done","not translated yet","Not done",null,null,"Not done","not translated yet","Not done",null,"Not done","not translated yet","Not done",null,null,"Not done","not translated yet","Not done",null,null,"Not done","not translated yet","Not done",null,null,"Not done","not translated yet","Not done",null,null,"Not done","not translated yet","Not done",null,null,null,null,null,null,null,null,207,0,0,"Not done","Not done",0,0,0,"Not done",0,0,"Not done","Not done","Not done","Not done","Not done","Not done","Not done",null,null,null,null,0,0,"not translated yet","not translated yet","Translate from EN_UK or DE","Translate from EN_UK or DE","Translate from EN_UK or DE","not translated yet","Translate from EN_UK or DE","Translate from EN_UK or DE","not translated yet","not translated yet","not translated yet","not translated yet","not translated yet","not translated yet","not translated yet",null,null,null,null,null,0,0,"Not done","Not done",0,0,0,"Not done",0,0,"Not done","Not done","Not done","Not done","Not done","Not done","Not done"]
[null,null,null,null,null,null,null,null,null,null,"Not done","not translated yet","Not done",null,null,"Not done","not translated yet","Not done",null,null,null,"Translate from EN_UK or DE",null,null,null,null,"Translate from EN_UK or DE",null,null,null,null,"Translate from EN_UK or DE",null,null,null,"Not done","not translated yet","Not done",null,null,null,"Translate from EN_UK or DE",null,null,null,null,"Translate from EN_UK or DE",null,null,null,"Not done","not translated yet","Not done",null,null,"Not done","not translated yet","Not done",null,"Not done","not translated yet","Not done",null,null,"Not done","not translated yet","Not done",null,null,"Not done","not translated yet","Not done",null,null,"Not done","not translated yet","Not done",null,null,"Not done","not translated yet","Not done",null,null,null,null,null,null,null,null,208,0,0,"Not done","Not done",0,0,0,"Not done",0,0,"Not done","Not done","Not done","Not done","Not done","Not done","Not done",null,null,null,null,0,0,"not translated yet","not translated yet","Translate from EN_UK or DE","Translate from EN_UK or DE","Translate from EN_UK or DE","not translated yet","Translate from EN_UK or DE","Translate from EN_UK or DE","not translated yet","not translated yet","not translated yet","not translated yet","not translated yet","not translated yet","not translated yet",null,null,null,null,null,0,0,"Not done","Not done",0,0,0,"Not done",0,0,"Not done","Not done","Not done","Not done","Not done","Not done","Not done"]
[null,null,null,null,null,null,null,null,null,null,"Not done","not translated yet","Not done",null,null,"Not done","not translated yet","Not done",null,null,null,"Translate from EN_UK or DE",null,null,null,null,"Translate from EN_UK or DE",null,null,null,null,"Translate from EN_UK or DE",null,null,null,"Not done","not translated yet","Not done",null,null,null,"Translate from EN_UK or DE",null,null,null,null,"Translate from EN_UK or DE",null,null,null,"Not done","not translated yet","Not done",null,null,"Not done","not translated yet","Not done",null,"Not done","not translated yet","Not done",null,null,"Not done","not translated yet","Not done",null,null,"Not done","not translated yet","Not done",null,null,"Not done","not translated yet","Not done",null,null,"Not done","not translated yet","Not done",null,null,null,null,null,null,null,null,209,0,0,"Not done","Not done",0,0,0,"Not done",0,0,"Not done","Not done","Not done","Not done","Not done","Not done","Not done",null,null,null,null,0,0,"not translated yet","not translated yet","Translate from EN_UK or DE","Translate from EN_UK or DE","Translate from EN_UK or DE","not translated yet","Translate from EN_UK or DE","Translate from EN_UK or DE","not translated yet","not translated yet","not translated yet","not translated yet","not translated yet","not translated yet","not translated yet",null,null,null,null,null,0,0,"Not done","Not done",0,0,0,"Not done",0,0,"Not done","Not done","Not done","Not done","Not done","Not done","Not done"]
[null,null,null,null,null,null,null,null,null,null,"Not done","not translated yet","Not done",null,null,"Not done","not translated yet","Not done",null,null,null,"Translate from EN_UK or DE",null,null,null,null,"Translate from EN_UK or DE",null,null,null,null,"Translate from EN_UK or DE",null,null,null,"Not done","not translated yet","Not done",null,null,null,"Translate from EN_UK or DE",null,null,null,null,"Translate from EN_UK or DE",null,null,null,"Not done","not translated yet","Not done",null,null,"Not done","not translated yet","Not done",null,"Not done","not translated yet","Not done",null,null,"Not done","not translated yet","Not done",null,null,"Not done","not translated yet","Not done",null,null,"Not done","not translated yet","Not done",null,null,"Not done","not translated yet","Not done",null,null,null,null,null,null,null,null,210,0,0,"Not done","Not done",0,0,0,"Not done",0,0,"Not done","Not done","Not done","Not done","Not done","Not done","Not done",null,null,null,null,0,0,"not translated yet","not translated yet","Translate from EN_UK or DE","Translate from EN_UK or DE","Translate from EN_UK or DE","not translated yet","Translate from EN_UK or DE","Translate from EN_UK or DE","not translated yet","not translated yet","not translated yet","not translated yet","not translated yet","not translated yet","not translated yet",null,null,null,null,null,0,0,"Not done","Not done",0,0,0,"Not done",0,0,"Not done","Not done","Not done","Not done","Not done","Not done","Not done"]
[null,null,null,null,null,null,null,null,null,null,"Not done","not translated yet","Not done",null,null,"Not done","not translated yet","Not done",null,null,null,"Translate from EN_UK or DE",null,null,null,null,"Translate from EN_UK or DE",null,null,null,null,"Translate from EN_UK or DE",null,null,null,"Not done","not translated yet","Not done",null,null,null,"Translate from EN_UK or DE",null,null,null,null,"Translate from EN_UK or DE",null,null,null,"Not done","not translated yet","Not done",null,null,"Not done","not translated yet","Not done",null,"Not done","not translated yet","Not done",null,null,"Not done","not translated yet","Not done",null,null,"Not done","not translated yet","Not done",null,null,"Not done","not translated yet","Not done",null,null,"Not done","not translated yet","Not done",null,null,null,null,null,null,null,null,211,0,0,"Not done","Not done",0,0,0,"Not done",0,0,"Not done","Not done","Not done","Not done","Not done","Not done","Not done",null,null,null,null,0,0,"not translated yet","not translated yet","Translate from EN_UK or DE","Translate from EN_UK or DE","Translate from EN_UK or DE","not translated yet","Translate from EN_UK or DE","Translate from EN_UK or DE","not translated yet","not translated yet","not translated yet","not translated yet","not translated yet","not translated yet","not translated yet",null,null,null,null,null,0,0,"Not done","Not done",0,0,0,"Not done",0,0,"Not done","Not done","Not done","Not done","Not done","Not done","Not done"]
[null,null,null,null,null,null,null,null,null,null,"Not done","not translated yet","Not done",null,null,"Not done","not translated yet","Not done",null,null,null,"Translate from EN_UK or DE",null,null,null,null,"Translate from EN_UK or DE",null,null,null,null,"Translate from EN_UK or DE",null,null,null,"Not done","not translated yet","Not done",null,null,null,"Translate from EN_UK or DE",null,null,null,null,"Translate from EN_UK or DE",null,null,null,"Not done","not translated yet","Not done",null,null,"Not done","not translated yet","Not done",null,"Not done","not translated yet","Not done",null,null,"Not done","not translated yet","Not done",null,null,"Not done","not translated yet","Not done",null,null,"Not done","not translated yet","Not done",null,null,"Not done","not translated yet","Not done",null,null,null,null,null,null,null,null,212,0,0,"Not done","Not done",0,0,0,"Not done",0,0,"Not done","Not done","Not done","Not done","Not done","Not done","Not done",null,null,null,null,0,0,"not translated yet","not translated yet","Translate from EN_UK or DE","Translate from EN_UK or DE","Translate from EN_UK or DE","not translated yet","Translate from EN_UK or DE","Translate from EN_UK or DE","not translated yet","not translated yet","not translated yet","not translated yet","not translated yet","not translated yet","not translated yet",null,null,null,null,null,0,0,"Not done","Not done",0,0,0,"Not done",0,0,"Not done","Not done","Not done","Not done","Not done","Not done","Not done"]
[null,null,null,null,null,null,null,null,null,null,"Not done","SPECIAL ITEMS US ONLY","Not done",null,null,"Not done","not translated yet","Not done",null,null,null,"Translate from EN_UK or DE",null,null,null,null,"Translate from EN_UK or DE",null,null,null,null,"Translate from EN_UK or DE",null,null,null,"Not done","not translated yet","Not done",null,null,null,"Translate from EN_UK or DE",null,null,null,null,"Translate from EN_UK or DE",null,null,null,"Not done","not translated yet","Not done",null,null,"Not done","not translated yet","Not done",null,"Not done","not translated yet","Not done",null,null,"Not done","not translated yet","Not done",null,null,"Not done","not translated yet","Not done",null,null,"Not done","not translated yet","Not done",null,null,"Not done","not translated yet","Not done",null,null,null,null,null,null,null,null,213,0,0,"Not done","Not done",0,0,0,"Not done",0,0,"Not done","Not done","Not done","Not done","Not done","Not done","Not done",null,null,null,null,0,0,"SPECIAL ITEMS US ONLY","not translated yet","Translate from EN_UK or DE","Translate from EN_UK or DE","Translate from EN_UK or DE","not translated yet","Translate from EN_UK or DE","Translate from EN_UK or DE","not translated yet","not translated yet","not translated yet","not translated yet","not translated yet","not translated yet","not translated yet",null,null,null,null,null,0,0,"Not done","Not done",0,0,0,"Not done",0,0,"Not done","Not done","Not done","Not done","Not done","Not done","Not done"]
[null,null,null,null,null,null,null,null,null,null,500000,"Wattstoper Single Push Button with LED",14.5]
[null,null,null,null,null,null,null,null,null,null,500001,"Wattstoper 2 Push Button with LED",14.5]
[null,null,null,null,null,null,null,null,null,null,500002,"Wattstoper 4 Push Button with LED",19.5]
[null,null,null,null,null,null,null,null,null,null,500003,"Wattstoper 8 Push Button with LED",39]
[null,null,null,null,null,null,null,null,null,null,500004,"Wattstoper Motion detector and Switch",68]
[null,null,null,null,null,null,null,null,null,null,500005,"Wattstoper Ceiling/Wall Motion Detector",79]
[null,null,null,null,null,null,null,null,null,null,"500033","Wattstoper Switch Cover Single Gang Plate",3.5]
[null,null,null,null,null,null,null,null,null,null,"500034","Wattstoper Switch Cover SDouble Gang Plate",7]